Skip to main content

[Date Prev][Date Next][Thread Prev][Thread Next][Date Index][Thread Index] [List Home]
[egit-build] [Hudson] Build failed in Hudson: egit-stable #162

See <https://hudson.eclipse.org/egit/job/egit-stable/162/changes>

Changes:

[Robin Stocker] Fix instability in CommitActionTest

------------------------------------------
[...truncated 1363 lines...]
[INFO] --- tycho-packaging-plugin:0.17.0:build-qualifier-aggregator (default-build-qualifier-aggregator) @ org.eclipse.egit.repository ---
[INFO] 
[INFO] --- maven-clean-plugin:2.4.1:clean (default-clean-1) @ org.eclipse.egit.repository ---
[INFO] 
[INFO] --- tycho-p2-publisher-plugin:0.17.0:publish-products (default-publish-products) @ org.eclipse.egit.repository ---
[INFO] 
[INFO] --- tycho-p2-publisher-plugin:0.17.0:publish-categories (default-publish-categories) @ org.eclipse.egit.repository ---
[INFO] 
[INFO] --- tycho-p2-publisher-plugin:0.17.0:attach-artifacts (default-attach-artifacts) @ org.eclipse.egit.repository ---
[INFO] 
[INFO] --- tycho-p2-repository-plugin:0.17.0:assemble-repository (default-assemble-repository) @ org.eclipse.egit.repository ---
[INFO] 
[INFO] --- tycho-p2-repository-plugin:0.17.0:archive-repository (default-archive-repository) @ org.eclipse.egit.repository ---
[INFO] Building zip: /jobs/genie.technology.egit/egit-stable/workspace/org.eclipse.egit.repository/target/org.eclipse.egit.repository-3.0.2-SNAPSHOT.zip
[INFO] 
[INFO] --- eclipse-signing-maven-plugin:1.0.5:pack (pack) @ org.eclipse.egit.repository ---
Downloading: http://maven.eclipse.org/nexus/content/repositories/milestone-indigo/org/apache/maven/maven-project/2.0.8/maven-project-2.0.8.pom
Downloading: http://repo.maven.apache.org/maven2/org/apache/maven/maven-project/2.0.8/maven-project-2.0.8.pom
Downloaded: http://repo.maven.apache.org/maven2/org/apache/maven/maven-project/2.0.8/maven-project-2.0.8.pom (3 KB at 5.8 KB/sec)
Downloading: http://maven.eclipse.org/nexus/content/repositories/milestone-indigo/org/apache/maven/maven/2.0.8/maven-2.0.8.pom
Downloading: http://repo.maven.apache.org/maven2/org/apache/maven/maven/2.0.8/maven-2.0.8.pom
Downloaded: http://repo.maven.apache.org/maven2/org/apache/maven/maven/2.0.8/maven-2.0.8.pom (12 KB at 49.6 KB/sec)
Downloading: http://maven.eclipse.org/nexus/content/repositories/milestone-indigo/org/apache/maven/maven-settings/2.0.8/maven-settings-2.0.8.pom
Downloading: http://repo.maven.apache.org/maven2/org/apache/maven/maven-settings/2.0.8/maven-settings-2.0.8.pom
Downloaded: http://repo.maven.apache.org/maven2/org/apache/maven/maven-settings/2.0.8/maven-settings-2.0.8.pom (3 KB at 10.4 KB/sec)
Downloading: http://maven.eclipse.org/nexus/content/repositories/milestone-indigo/org/apache/maven/maven-model/2.0.8/maven-model-2.0.8.pom
Downloading: http://repo.maven.apache.org/maven2/org/apache/maven/maven-model/2.0.8/maven-model-2.0.8.pom
Downloaded: http://repo.maven.apache.org/maven2/org/apache/maven/maven-model/2.0.8/maven-model-2.0.8.pom (4 KB at 15.9 KB/sec)
Downloading: http://maven.eclipse.org/nexus/content/repositories/milestone-indigo/org/apache/maven/maven-profile/2.0.8/maven-profile-2.0.8.pom
Downloading: http://repo.maven.apache.org/maven2/org/apache/maven/maven-profile/2.0.8/maven-profile-2.0.8.pom
Downloaded: http://repo.maven.apache.org/maven2/org/apache/maven/maven-profile/2.0.8/maven-profile-2.0.8.pom (2 KB at 10.1 KB/sec)
Downloading: http://maven.eclipse.org/nexus/content/repositories/milestone-indigo/org/apache/maven/maven-artifact-manager/2.0.8/maven-artifact-manager-2.0.8.pom
Downloading: http://repo.maven.apache.org/maven2/org/apache/maven/maven-artifact-manager/2.0.8/maven-artifact-manager-2.0.8.pom
Downloaded: http://repo.maven.apache.org/maven2/org/apache/maven/maven-artifact-manager/2.0.8/maven-artifact-manager-2.0.8.pom (3 KB at 13.7 KB/sec)
Downloading: http://maven.eclipse.org/nexus/content/repositories/milestone-indigo/org/apache/maven/maven-repository-metadata/2.0.8/maven-repository-metadata-2.0.8.pom
Downloading: http://repo.maven.apache.org/maven2/org/apache/maven/maven-repository-metadata/2.0.8/maven-repository-metadata-2.0.8.pom
Downloaded: http://repo.maven.apache.org/maven2/org/apache/maven/maven-repository-metadata/2.0.8/maven-repository-metadata-2.0.8.pom (2 KB at 9.7 KB/sec)
Downloading: http://maven.eclipse.org/nexus/content/repositories/milestone-indigo/org/apache/maven/maven-artifact/2.0.8/maven-artifact-2.0.8.pom
Downloading: http://repo.maven.apache.org/maven2/org/apache/maven/maven-artifact/2.0.8/maven-artifact-2.0.8.pom
Downloaded: http://repo.maven.apache.org/maven2/org/apache/maven/maven-artifact/2.0.8/maven-artifact-2.0.8.pom (2 KB at 8.2 KB/sec)
Downloading: http://maven.eclipse.org/nexus/content/repositories/milestone-indigo/org/apache/maven/maven-plugin-registry/2.0.8/maven-plugin-registry-2.0.8.pom
Downloading: http://repo.maven.apache.org/maven2/org/apache/maven/maven-plugin-registry/2.0.8/maven-plugin-registry-2.0.8.pom
Downloaded: http://repo.maven.apache.org/maven2/org/apache/maven/maven-plugin-registry/2.0.8/maven-plugin-registry-2.0.8.pom (2 KB at 10.1 KB/sec)
Downloading: http://maven.eclipse.org/nexus/content/repositories/milestone-indigo/org/apache/maven/maven-plugin-api/2.0.8/maven-plugin-api-2.0.8.pom
Downloading: http://repo.maven.apache.org/maven2/org/apache/maven/maven-plugin-api/2.0.8/maven-plugin-api-2.0.8.pom
Downloaded: http://repo.maven.apache.org/maven2/org/apache/maven/maven-plugin-api/2.0.8/maven-plugin-api-2.0.8.pom (2 KB at 7.5 KB/sec)
Downloading: http://maven.eclipse.org/nexus/content/repositories/milestone-indigo/org/apache/maven/maven-plugin-tools-api/2.1/maven-plugin-tools-api-2.1.pom
Downloading: http://repo.maven.apache.org/maven2/org/apache/maven/maven-plugin-tools-api/2.1/maven-plugin-tools-api-2.1.pom
Downloaded: http://repo.maven.apache.org/maven2/org/apache/maven/maven-plugin-tools-api/2.1/maven-plugin-tools-api-2.1.pom (2 KB at 9.2 KB/sec)
Downloading: http://maven.eclipse.org/nexus/content/repositories/milestone-indigo/org/apache/maven/maven-plugin-tools/2.1/maven-plugin-tools-2.1.pom
Downloading: http://repo.maven.apache.org/maven2/org/apache/maven/maven-plugin-tools/2.1/maven-plugin-tools-2.1.pom
Downloaded: http://repo.maven.apache.org/maven2/org/apache/maven/maven-plugin-tools/2.1/maven-plugin-tools-2.1.pom (4 KB at 16.8 KB/sec)
Downloading: http://maven.eclipse.org/nexus/content/repositories/milestone-indigo/org/apache/maven/shared/maven-shared-components/7/maven-shared-components-7.pom
Downloading: http://repo.maven.apache.org/maven2/org/apache/maven/shared/maven-shared-components/7/maven-shared-components-7.pom
Downloaded: http://repo.maven.apache.org/maven2/org/apache/maven/shared/maven-shared-components/7/maven-shared-components-7.pom (3 KB at 13.2 KB/sec)
Downloading: http://maven.eclipse.org/nexus/content/repositories/milestone-indigo/org/apache/maven/maven-plugin-descriptor/2.0.5/maven-plugin-descriptor-2.0.5.pom
Downloading: http://repo.maven.apache.org/maven2/org/apache/maven/maven-plugin-descriptor/2.0.5/maven-plugin-descriptor-2.0.5.pom
Downloaded: http://repo.maven.apache.org/maven2/org/apache/maven/maven-plugin-descriptor/2.0.5/maven-plugin-descriptor-2.0.5.pom (2 KB at 8.6 KB/sec)
Downloading: http://maven.eclipse.org/nexus/content/repositories/milestone-indigo/org/apache/maven/maven/2.0.5/maven-2.0.5.pom
Downloading: http://repo.maven.apache.org/maven2/org/apache/maven/maven/2.0.5/maven-2.0.5.pom
Downloaded: http://repo.maven.apache.org/maven2/org/apache/maven/maven/2.0.5/maven-2.0.5.pom (6 KB at 23.4 KB/sec)
Downloading: http://maven.eclipse.org/nexus/content/repositories/milestone-indigo/org/apache/maven/maven-plugin-api/2.0.5/maven-plugin-api-2.0.5.pom
Downloading: http://repo.maven.apache.org/maven2/org/apache/maven/maven-plugin-api/2.0.5/maven-plugin-api-2.0.5.pom
Downloaded: http://repo.maven.apache.org/maven2/org/apache/maven/maven-plugin-api/2.0.5/maven-plugin-api-2.0.5.pom (605 B at 3.1 KB/sec)
Downloading: http://maven.eclipse.org/nexus/content/repositories/milestone-indigo/org/apache/maven/maven-artifact/2.0.5/maven-artifact-2.0.5.pom
Downloading: http://repo.maven.apache.org/maven2/org/apache/maven/maven-artifact/2.0.5/maven-artifact-2.0.5.pom
Downloaded: http://repo.maven.apache.org/maven2/org/apache/maven/maven-artifact/2.0.5/maven-artifact-2.0.5.pom (727 B at 3.7 KB/sec)
Downloading: http://maven.eclipse.org/nexus/content/repositories/milestone-indigo/org/codehaus/plexus/plexus-archiver/2.0/plexus-archiver-2.0.pom
Downloading: http://repo.maven.apache.org/maven2/org/codehaus/plexus/plexus-archiver/2.0/plexus-archiver-2.0.pom
Downloaded: http://repo.maven.apache.org/maven2/org/codehaus/plexus/plexus-archiver/2.0/plexus-archiver-2.0.pom (3 KB at 13.5 KB/sec)
Downloading: http://maven.eclipse.org/nexus/content/repositories/milestone-indigo/org/codehaus/plexus/plexus-io/2.0/plexus-io-2.0.pom
Downloading: http://repo.maven.apache.org/maven2/org/codehaus/plexus/plexus-io/2.0/plexus-io-2.0.pom
Downloaded: http://repo.maven.apache.org/maven2/org/codehaus/plexus/plexus-io/2.0/plexus-io-2.0.pom (2 KB at 7.9 KB/sec)
Downloading: http://maven.eclipse.org/nexus/content/repositories/milestone-indigo/org/codehaus/mojo/wagon-maven-plugin/1.0-beta-3/wagon-maven-plugin-1.0-beta-3.pom
Downloading: http://repo.maven.apache.org/maven2/org/codehaus/mojo/wagon-maven-plugin/1.0-beta-3/wagon-maven-plugin-1.0-beta-3.pom
Downloaded: http://repo.maven.apache.org/maven2/org/codehaus/mojo/wagon-maven-plugin/1.0-beta-3/wagon-maven-plugin-1.0-beta-3.pom (4 KB at 19.3 KB/sec)
Downloading: http://maven.eclipse.org/nexus/content/repositories/milestone-indigo/org/codehaus/mojo/mojo-parent/23/mojo-parent-23.pom
Downloading: http://repo.maven.apache.org/maven2/org/codehaus/mojo/mojo-parent/23/mojo-parent-23.pom
Downloaded: http://repo.maven.apache.org/maven2/org/codehaus/mojo/mojo-parent/23/mojo-parent-23.pom (23 KB at 78.1 KB/sec)
Downloading: http://maven.eclipse.org/nexus/content/repositories/milestone-indigo/org/codehaus/plexus/plexus-utils/1.4.2/plexus-utils-1.4.2.pom
Downloading: http://repo.maven.apache.org/maven2/org/codehaus/plexus/plexus-utils/1.4.2/plexus-utils-1.4.2.pom
Downloaded: http://repo.maven.apache.org/maven2/org/codehaus/plexus/plexus-utils/1.4.2/plexus-utils-1.4.2.pom (2 KB at 10.0 KB/sec)
Downloading: http://maven.eclipse.org/nexus/content/repositories/milestone-indigo/org/apache/maven/maven-plugin-tools-api/2.1/maven-plugin-tools-api-2.1.jar
Downloading: http://maven.eclipse.org/nexus/content/repositories/milestone-indigo/org/codehaus/plexus/plexus-archiver/2.0/plexus-archiver-2.0.jar
Downloading: http://maven.eclipse.org/nexus/content/repositories/milestone-indigo/org/codehaus/plexus/plexus-io/2.0/plexus-io-2.0.jar
Downloading: http://maven.eclipse.org/nexus/content/repositories/milestone-indigo/org/codehaus/plexus/plexus-utils/3.0/plexus-utils-3.0.jar
Downloading: http://maven.eclipse.org/nexus/content/repositories/milestone-indigo/org/codehaus/mojo/wagon-maven-plugin/1.0-beta-3/wagon-maven-plugin-1.0-beta-3.jar
Downloading: http://repo.maven.apache.org/maven2/org/apache/maven/maven-plugin-tools-api/2.1/maven-plugin-tools-api-2.1.jar
Downloading: http://repo.maven.apache.org/maven2/org/codehaus/plexus/plexus-archiver/2.0/plexus-archiver-2.0.jar
Downloading: http://repo.maven.apache.org/maven2/org/codehaus/plexus/plexus-io/2.0/plexus-io-2.0.jar
Downloading: http://repo.maven.apache.org/maven2/org/codehaus/plexus/plexus-utils/3.0/plexus-utils-3.0.jar
Downloading: http://repo.maven.apache.org/maven2/org/codehaus/mojo/wagon-maven-plugin/1.0-beta-3/wagon-maven-plugin-1.0-beta-3.jar
Downloaded: http://repo.maven.apache.org/maven2/org/apache/maven/maven-plugin-tools-api/2.1/maven-plugin-tools-api-2.1.jar (29 KB at 99.4 KB/sec)
Downloaded: http://repo.maven.apache.org/maven2/org/codehaus/plexus/plexus-archiver/2.0/plexus-archiver-2.0.jar (176 KB at 375.4 KB/sec)
Downloaded: http://repo.maven.apache.org/maven2/org/codehaus/mojo/wagon-maven-plugin/1.0-beta-3/wagon-maven-plugin-1.0-beta-3.jar (45 KB at 65.2 KB/sec)
Downloaded: http://repo.maven.apache.org/maven2/org/codehaus/plexus/plexus-io/2.0/plexus-io-2.0.jar (57 KB at 77.8 KB/sec)
Downloaded: http://repo.maven.apache.org/maven2/org/codehaus/plexus/plexus-utils/3.0/plexus-utils-3.0.jar (221 KB at 256.1 KB/sec)
[INFO] [PACK] creating directory to hold packed output
[INFO] [PACK] creating directory to hold pack staging bits
[INFO] [PACK] getting jar packer into position
[INFO] [PACK] executing pack200, output at end of execution : /bin/sh -c cd /jobs/genie.technology.egit/egit-stable/workspace/org.eclipse.egit.repository/target/pack-stage && /usr/local/bin/java -Dorg.eclipse.update.jarprocessor.pack200=/shared/common/jdk-1.5.0-22.x86_64/bin -jar /jobs/genie.technology.egit/egit-stable/workspace/org.eclipse.egit.repository/target/pack-stage/org.eclipse.equinox.p2.jarprocessor_1.0.200.v20100503a.jar -processAll -pack -repack -verbose -outputDir /jobs/genie.technology.egit/egit-stable/workspace/org.eclipse.egit.repository/target/packed /jobs/genie.technology.egit/egit-stable/workspace/org.eclipse.egit.repository/target/org.eclipse.egit.repository-3.0.2-SNAPSHOT.zip
[INFO] [PACK] pack200 output:

[ERROR] /bin/sh: /usr/local/bin/java: No such file or directory

[INFO] 
[INFO] --- eclipse-signing-maven-plugin:1.0.5:sign (sign) @ org.eclipse.egit.repository ---
[INFO] [SIGN] creating directory to hold signed artifact
input file /jobs/genie.technology.egit/egit-stable/workspace/org.eclipse.egit.repository/target/org.eclipse.egit.repository-3.0.2-SNAPSHOT.zip
/jobs/genie.technology.egit/egit-stable/workspace/org.eclipse.egit.repository/target/org.eclipse.egit.repository-3.0.2-SNAPSHOT.zip - unarchived into - /jobs/genie.technology.egit/egit-stable/workspace/org.eclipse.egit.repository/target/repository
/jobs/genie.technology.egit/egit-stable/workspace/org.eclipse.egit.repository/target/org.eclipse.egit.repository-3.0.2-SNAPSHOT.zip unarchived into /jobs/genie.technology.egit/egit-stable/workspace/org.eclipse.egit.repository/target/repository
....archive /jobs/genie.technology.egit/egit-stable/workspace/org.eclipse.egit.repository/target/repository into /jobs/genie.technology.egit/egit-stable/workspace/org.eclipse.egit.repository/target/org.eclipse.egit.repository-3.0.2-SNAPSHOT.zip
looking at 
looking at features
looking at plugins
looking at artifacts.jar
looking at features/org.eclipse.jgit.source_3.0.2.201308212318.jar
looking at features/org.eclipse.egit_3.0.2.201308220912.jar
looking at features/org.eclipse.jgit.pgm_3.0.2.201308212318.jar
looking at features/org.eclipse.jgit_3.0.2.201308212318.jar
looking at features/org.eclipse.jgit.pgm.source_3.0.2.201308212318.jar
looking at features/org.eclipse.egit.source_3.0.2.201308220912.jar
looking at features/org.eclipse.egit.mylyn_3.0.2.201308220912.jar
looking at features/org.eclipse.jgit.java7_3.0.2.201308212318.jar
looking at plugins/javaewah_0.5.6.v201210150900.jar
looking at plugins/org.eclipse.egit_3.0.2.201308220912.jar
looking at plugins/org.eclipse.jgit.java7_3.0.2.201308211911.jar
looking at plugins/org.eclipse.egit.ui_3.0.2.201308220912.jar
looking at plugins/org.eclipse.jgit.source_3.0.2.201308211911.jar
looking at plugins/org.eclipse.jgit.pgm.source_3.0.2.201308211911.jar
looking at plugins/org.eclipse.egit.mylyn.ui_3.0.2.201308220912.jar
looking at plugins/org.eclipse.egit.core_3.0.2.201308220912.jar
looking at plugins/org.eclipse.jgit.ui_3.0.2.201308211911.jar
looking at plugins/org.eclipse.egit.ui.source_3.0.2.201308220912.jar
looking at plugins/org.apache.commons.compress_1.4.1.v201301140946.jar
looking at plugins/org.eclipse.egit.core.source_3.0.2.201308220912.jar
looking at plugins/org.eclipse.jgit_3.0.2.201308211911.jar
looking at plugins/org.kohsuke.args4j_2.0.21.v201301150030.jar
looking at plugins/com.jcraft.jsch_0.1.46.v201205102330.jar
looking at plugins/org.eclipse.jgit.pgm_3.0.2.201308211911.jar
looking at plugins/org.eclipse.egit.mylyn.ui.source_3.0.2.201308220912.jar
looking at plugins/org.eclipse.egit.doc_3.0.2.201308220912.jar
looking at content.jar
[INFO] Building zip: /jobs/genie.technology.egit/egit-stable/workspace/org.eclipse.egit.repository/target/org.eclipse.egit.repository-3.0.2-SNAPSHOT.zip-after-removing.zip
[ERROR] 
java.lang.ArrayIndexOutOfBoundsException: 9
	at org.codehaus.plexus.components.io.attributes.Java7FileAttributes.checkFlag(Java7FileAttributes.java:131)
	at org.codehaus.plexus.components.io.attributes.Java7FileAttributes.isWorldExecutable(Java7FileAttributes.java:161)
	at org.codehaus.plexus.components.io.attributes.Java7FileAttributes.getOctalMode(Java7FileAttributes.java:235)
	at org.codehaus.plexus.archiver.AbstractArchiver.asArchiveEntry(AbstractArchiver.java:333)
	at org.codehaus.plexus.archiver.AbstractArchiver$1.hasNext(AbstractArchiver.java:459)
	at org.codehaus.plexus.archiver.zip.AbstractZipArchiver.addResources(AbstractZipArchiver.java:367)
	at org.codehaus.plexus.archiver.zip.AbstractZipArchiver.createArchiveMain(AbstractZipArchiver.java:312)
	at org.codehaus.plexus.archiver.zip.AbstractZipArchiver.execute(AbstractZipArchiver.java:211)
	at org.codehaus.plexus.archiver.AbstractArchiver.createArchive(AbstractArchiver.java:875)
	at org.eclipse.dash.m4e.eclipse.signing.SignMojo.execute(SignMojo.java:162)
	at org.apache.maven.plugin.DefaultBuildPluginManager.executeMojo(DefaultBuildPluginManager.java:101)
	at org.apache.maven.lifecycle.internal.MojoExecutor.execute(MojoExecutor.java:209)
	at org.apache.maven.lifecycle.internal.MojoExecutor.execute(MojoExecutor.java:153)
	at org.apache.maven.lifecycle.internal.MojoExecutor.execute(MojoExecutor.java:145)
	at org.apache.maven.lifecycle.internal.LifecycleModuleBuilder.buildProject(LifecycleModuleBuilder.java:84)
	at org.apache.maven.lifecycle.internal.LifecycleModuleBuilder.buildProject(LifecycleModuleBuilder.java:59)
	at org.apache.maven.lifecycle.internal.LifecycleStarter.singleThreadedBuild(LifecycleStarter.java:183)
	at org.apache.maven.lifecycle.internal.LifecycleStarter.execute(LifecycleStarter.java:161)
	at org.apache.maven.DefaultMaven.doExecute(DefaultMaven.java:320)
	at org.apache.maven.DefaultMaven.execute(DefaultMaven.java:156)
	at org.apache.maven.cli.MavenCli.execute(MavenCli.java:537)
	at org.apache.maven.cli.MavenCli.doMain(MavenCli.java:196)
	at org.apache.maven.cli.MavenCli.main(MavenCli.java:141)
	at sun.reflect.NativeMethodAccessorImpl.invoke0(Native Method)
	at sun.reflect.NativeMethodAccessorImpl.invoke(NativeMethodAccessorImpl.java:57)
	at sun.reflect.DelegatingMethodAccessorImpl.invoke(DelegatingMethodAccessorImpl.java:43)
	at java.lang.reflect.Method.invoke(Method.java:606)
	at org.codehaus.plexus.classworlds.launcher.Launcher.launchEnhanced(Launcher.java:290)
	at org.codehaus.plexus.classworlds.launcher.Launcher.launch(Launcher.java:230)
	at org.codehaus.plexus.classworlds.launcher.Launcher.mainWithExitCode(Launcher.java:409)
	at org.codehaus.plexus.classworlds.launcher.Launcher.main(Launcher.java:352)
[INFO] 
[INFO] --- eclipse-signing-maven-plugin:1.0.5:pack (repack) @ org.eclipse.egit.repository ---
[INFO] ------------------------------------------------------------------------
[INFO] Reactor Summary:
[INFO] 
[INFO] EGit Parent ....................................... SUCCESS [1.975s]
[INFO] EGit Target Platform Definition ................... SUCCESS [0.595s]
[INFO] Eclipse EGit ...................................... SUCCESS [1.957s]
[INFO] Git Team Provider (Core) .......................... SUCCESS [21.986s]
[INFO] Git Team Provider (UI) ............................ SUCCESS [49.440s]
[INFO] EGit Mylyn UI ..................................... SUCCESS [9.476s]
[INFO] Git Team Provider (Documentation) ................. SUCCESS [1.901s]
[INFO] Eclipse EGit Feature .............................. SUCCESS [1.451s]
[INFO] EGit Mylyn Feature ................................ SUCCESS [1.093s]
[INFO] EGit Core Test Plug-in ............................ SUCCESS [44.874s]
[INFO] EGit UI Test Plug-in .............................. SUCCESS [9:31.647s]
[INFO] EGit Mylyn UI Test Plug-in ........................ SUCCESS [21.760s]
[INFO] Eclipse EGit Source Feature ....................... SUCCESS [1.107s]
[INFO] EGit P2 Repository ................................ FAILURE [13.610s]
[INFO] ------------------------------------------------------------------------
[INFO] BUILD FAILURE
[INFO] ------------------------------------------------------------------------
[INFO] Total time: 12:57.795s
[INFO] Finished at: Thu Aug 22 05:24:41 EDT 2013
[INFO] Final Memory: 128M/1656M
[INFO] ------------------------------------------------------------------------
[INFO] o.h.m.e.h.MavenExecutionResultHandler - Build failed with exception(s)
[INFO] o.h.m.e.h.MavenExecutionResultHandler - [1] org.apache.maven.lifecycle.LifecycleExecutionException: Failed to execute goal org.eclipse.dash.maven:eclipse-signing-maven-plugin:1.0.5:pack (repack) on project org.eclipse.egit.repository: file to pack does not exist! -> /jobs/genie.technology.egit/egit-stable/workspace/org.eclipse.egit.repository/target/signed/site_assembly.zip
[DEBUG] Closing connection to remote
[ERROR] Failed to execute goal org.eclipse.dash.maven:eclipse-signing-maven-plugin:1.0.5:pack (repack) on project org.eclipse.egit.repository: file to pack does not exist! -> /jobs/genie.technology.egit/egit-stable/workspace/org.eclipse.egit.repository/target/signed/site_assembly.zip -> [Help 1]
org.apache.maven.lifecycle.LifecycleExecutionException: Failed to execute goal org.eclipse.dash.maven:eclipse-signing-maven-plugin:1.0.5:pack (repack) on project org.eclipse.egit.repository: file to pack does not exist! -> /jobs/genie.technology.egit/egit-stable/workspace/org.eclipse.egit.repository/target/signed/site_assembly.zip
	at org.apache.maven.lifecycle.internal.MojoExecutor.execute(MojoExecutor.java:213)
	at org.apache.maven.lifecycle.internal.MojoExecutor.execute(MojoExecutor.java:153)
	at org.apache.maven.lifecycle.internal.MojoExecutor.execute(MojoExecutor.java:145)
	at org.apache.maven.lifecycle.internal.LifecycleModuleBuilder.buildProject(LifecycleModuleBuilder.java:84)
	at org.apache.maven.lifecycle.internal.LifecycleModuleBuilder.buildProject(LifecycleModuleBuilder.java:59)
	at org.apache.maven.lifecycle.internal.LifecycleStarter.singleThreadedBuild(LifecycleStarter.java:183)
	at org.apache.maven.lifecycle.internal.LifecycleStarter.execute(LifecycleStarter.java:161)
	at org.apache.maven.DefaultMaven.doExecute(DefaultMaven.java:320)
	at org.apache.maven.DefaultMaven.execute(DefaultMaven.java:156)
	at org.apache.maven.cli.MavenCli.execute(MavenCli.java:537)
	at org.apache.maven.cli.MavenCli.doMain(MavenCli.java:196)
	at org.apache.maven.cli.MavenCli.main(MavenCli.java:141)
	at sun.reflect.NativeMethodAccessorImpl.invoke0(Native Method)
	at sun.reflect.NativeMethodAccessorImpl.invoke(NativeMethodAccessorImpl.java:57)
	at sun.reflect.DelegatingMethodAccessorImpl.invoke(DelegatingMethodAccessorImpl.java:43)
	at java.lang.reflect.Method.invoke(Method.java:606)
	at org.codehaus.plexus.classworlds.launcher.Launcher.launchEnhanced(Launcher.java:290)
	at org.codehaus.plexus.classworlds.launcher.Launcher.launch(Launcher.java:230)
	at org.codehaus.plexus.classworlds.launcher.Launcher.mainWithExitCode(Launcher.java:409)
	at org.codehaus.plexus.classworlds.launcher.Launcher.main(Launcher.java:352)
Caused by: org.apache.maven.plugin.MojoFailureException: file to pack does not exist! -> /jobs/genie.technology.egit/egit-stable/workspace/org.eclipse.egit.repository/target/signed/site_assembly.zip
	at org.eclipse.dash.m4e.eclipse.signing.PackMojo.execute(PackMojo.java:109)
	at org.apache.maven.plugin.DefaultBuildPluginManager.executeMojo(DefaultBuildPluginManager.java:101)
	at org.apache.maven.lifecycle.internal.MojoExecutor.execute(MojoExecutor.java:209)
	... 19 more
[ERROR] 
[ERROR] Re-run Maven using the -X switch to enable full debug logging.
[ERROR] 
[ERROR] For more information about the errors and possible solutions, please read the following articles:
[ERROR] [Help 1] http://cwiki.apache.org/confluence/display/MAVEN/MojoFailureException
[ERROR] 
[ERROR] After correcting the problems, you can resume the build with the command
[ERROR]   mvn <goals> -rf :org.eclipse.egit.repository
[DEBUG] Waiting for process to finish
[DEBUG] Result: 1
Terminating xvnc.
[FINDBUGS] Skipping publisher since build result is FAILURE
[DRY] Skipping publisher since build result is FAILURE
[ANALYSIS-COLLECTOR] Skipping publisher since build result is FAILURE
Archiving artifacts
Recording test results

--
This message is automatically generated by Hudson. 
For more information on Hudson, see: http://hudson-ci.org/


Back to the top