Skip to main content

[Date Prev][Date Next][Thread Prev][Thread Next][Date Index][Thread Index] [List Home]
[wtp-releng] [Hudson] Build failed in Hudson: WTP-R3_7_Integration #151

See <https://hudson.eclipse.org/webtools/job/WTP-R3_7_Integration/151/>

------------------------------------------
[...truncated 618168 lines...]
[INFO] org.eclipse.wst.xml.xpath.core .................... SUCCESS [  3.938 s]
[INFO] PsychoPath XPath 2.0 Processor .................... SUCCESS [  3.913 s]
[INFO] org.eclipse.wst.xml.xpath.ui ...................... SUCCESS [  4.472 s]
[INFO] PsychoPath XPath 2.0 Processor: User Documentation  SUCCESS [  4.075 s]
[INFO] PsychoPath XPath 2.0 Processor: Branding Plug-in .. SUCCESS [  3.715 s]
[INFO] PsychoPath XPath 2.0 Processor Feature ............ SUCCESS [  2.488 s]
[INFO] org.eclipse.webtools.sourceediting.xsl ............ SUCCESS [  0.048 s]
[INFO] XSLT Core Plugin .................................. SUCCESS [  7.229 s]
[INFO] XSLT Launching Plugin ............................. SUCCESS [  3.998 s]
[INFO] XSLT Debug UI Plugin .............................. SUCCESS [  5.014 s]
[INFO] org.eclipse.wst.xsl.doc ........................... SUCCESS [  5.885 s]
[INFO] XSLT EXSLT Core Plugin ............................ SUCCESS [  3.736 s]
[INFO] XSLT UI Plugin .................................... SUCCESS [  6.023 s]
[INFO] XSLT EXSLT UI Plugin .............................. SUCCESS [  4.128 s]
[INFO] XSLT JAXP Debug Plugin ............................ SUCCESS [  4.259 s]
[INFO] XSLT Xalan Plugin ................................. SUCCESS [  3.944 s]
[INFO] XSLT Saxon Plugin ................................. SUCCESS [  3.844 s]
[INFO] XSL Tools Branding Plugin ......................... SUCCESS [  3.887 s]
[INFO] XSLT JAXP Launching UI Plugin ..................... SUCCESS [  4.896 s]
[INFO] XSLT JAXP Debug UI Plugin ......................... SUCCESS [  5.049 s]
[INFO] XSLT FeaturePlugin ................................ SUCCESS [  3.744 s]
[INFO] org.eclipse.wst.xsl.sdk.documentation ............. SUCCESS [  4.510 s]
[INFO] org.eclipse.wst.xsl_sdk.feature ................... SUCCESS [  2.152 s]
[INFO] org.eclipse.wst.server.http.core .................. SUCCESS [  4.058 s]
[INFO] org.eclipse.wst.server.http.ui .................... SUCCESS [  4.231 s]
[INFO] org.eclipse.wst.server.preview .................... SUCCESS [  4.492 s]
[INFO] org.eclipse.wst.server.preview.adapter ............ SUCCESS [  4.094 s]
[INFO] org.eclipse.wst.server_adapters.feature ........... SUCCESS [  3.805 s]
[INFO] org.eclipse.wst.server_adapters.sdk.feature ....... SUCCESS [  2.050 s]
[INFO] org.eclipse.wst.sdk ............................... SUCCESS [  2.110 s]
[INFO] org.eclipse.wst.common.project.facet.core.tests ... SUCCESS [  9.540 s]
[INFO] org.eclipse.wst.common.project.facet.ui.tests ..... SUCCESS [  4.933 s]
[INFO] org.eclipse.wst.common.snippets.tests ............. SUCCESS [ 22.367 s]
[INFO] org.eclipse.wst.common.tests.ui ................... SUCCESS [  5.495 s]
[INFO] org.eclipse.wst.common.tests.validation ........... SUCCESS [01:00 min]
[INFO] org.eclipse.wst.common.tests.validation.guard ..... SUCCESS [  3.751 s]
[INFO] org.eclipse.wst.internet.cache.tests .............. SUCCESS [ 10.216 s]
[INFO] org.eclipse.wst.common_tests.feature .............. SUCCESS [  1.689 s]
[INFO] org.eclipse.wst.css.core.tests .................... SUCCESS [ 14.430 s]
[INFO] org.eclipse.wst.css.tests.encoding ................ SUCCESS [ 11.725 s]
[INFO] org.eclipse.wst.css.ui.tests ...................... SUCCESS [ 22.605 s]
[INFO] org.eclipse.wst.dtd.core.tests .................... SUCCESS [ 11.138 s]
[INFO] org.eclipse.wst.dtd.ui.tests ...................... SUCCESS [ 14.786 s]
[INFO] org.eclipse.wst.html.core.tests ................... SUCCESS [ 14.160 s]
[INFO] org.eclipse.wst.html.tests.encoding ............... SUCCESS [ 10.886 s]
[INFO] org.eclipse.wst.html.ui.tests ..................... SUCCESS [ 19.220 s]
[INFO] org.eclipse.wst.internet.monitor.core.tests ....... SUCCESS [  9.963 s]
[INFO] org.eclipse.wst.internet.monitor.ui.tests ......... SUCCESS [ 21.052 s]
[INFO] tests ............................................. SUCCESS [  0.054 s]
[INFO] org.eclipse.wst.jsdt.core.tests.compiler .......... SUCCESS [ 57.072 s]
[INFO] org.eclipse.wst.jsdt.core.tests.model ............. SUCCESS [ 52.670 s]
[INFO] org.eclipse.wst.jsdt.debug.core.tests ............. SUCCESS [ 20.182 s]
[INFO] org.eclipse.wst.jsdt.debug.rhino.tests ............ SUCCESS [ 29.148 s]
[INFO] org.eclipse.wst.jsdt.ui.tests ..................... SUCCESS [01:50 min]
[INFO] org.eclipse.wst.jsdt.web.core.tests ............... SUCCESS [  8.887 s]
[INFO] org.eclipse.wst.jsdt.web.ui.tests ................. SUCCESS [01:07 min]
[INFO] org.eclipse.wtp.releng.tests ...................... SUCCESS [  4.002 s]
[INFO] org.eclipse.wst.jsdt_tests.feature ................ SUCCESS [  1.928 s]
[INFO] org.eclipse.wst.server_tests.feature .............. SUCCESS [  1.690 s]
[INFO] org.eclipse.wst.sse.core.tests .................... SUCCESS [  7.684 s]
[INFO] org.eclipse.wst.sse.ui.tests ...................... SUCCESS [ 39.450 s]
[INFO] org.eclipse.wtp.releng.fixups ..................... SUCCESS [  4.145 s]
[INFO] org.eclipse.wtp.releng.fixups.feature ............. SUCCESS [  1.745 s]
[INFO] org.eclipse.wtp.releng.tools ...................... SUCCESS [  5.534 s]
[INFO] org.eclipse.wtp.releng.tools.feature .............. SUCCESS [  2.000 s]
[INFO] org.eclipse.wtp.releng.tests.feature .............. SUCCESS [  2.234 s]
[INFO] org.eclipse.wst.xml.catalog.tests ................. SUCCESS [ 11.535 s]
[INFO] org.eclipse.wst.xml.core.tests .................... SUCCESS [ 20.680 s]
[INFO] org.eclipse.wst.xml.ui.tests ...................... SUCCESS [ 51.281 s]
[INFO] org.eclipse.wst.xml.validation.tests .............. SUCCESS [ 11.607 s]
[INFO] org.eclipse.wst.xsd.validation.tests .............. SUCCESS [  9.688 s]
[INFO] org.eclipse.wst.xsd.core.tests .................... SUCCESS [ 10.929 s]
[INFO] org.eclipse.wst.xsd.ui.tests ...................... SUCCESS [ 15.987 s]
[INFO] org.eclipse.wst.xml_tests.feature ................. SUCCESS [  1.886 s]
[INFO] org.eclipse.webtools.sourceediting.xpath.tests .... SUCCESS [  0.025 s]
[INFO] org.eclipse.wst.xml.xpath.core.tests .............. SUCCESS [  7.511 s]
[INFO] org.eclipse.wst.xml.xpath.ui.tests ................ SUCCESS [ 10.487 s]
[INFO] PsychoPath XPath 2.0 Processor: XQuery Test Suite . SUCCESS [ 49.931 s]
[INFO] PsychoPath XPath 2.0 Processor: Tests ............. SUCCESS [ 52.254 s]
[INFO] org.eclipse.webtools.sourceediting.xsl.tests ...... SUCCESS [  0.052 s]
[INFO] XSLT Core Tests ................................... SUCCESS [  3.739 s]
[INFO] EXSLT Core Tests .................................. SUCCESS [  3.649 s]
[INFO] XSLT UI Tests ..................................... SUCCESS [  4.439 s]
[INFO] EXSLT UI Tests .................................... SUCCESS [  3.730 s]
[INFO] JAXP Debug Tests .................................. SUCCESS [  3.916 s]
[INFO] XSL Launching Tests ............................... SUCCESS [  4.560 s]
[INFO] org.eclipse.wst.xsl.tests ......................... SUCCESS [  3.941 s]
[INFO] org.eclipse.wst.xsl_tests.feature ................. SUCCESS [  4.075 s]
[INFO] org.eclipse.wst.web_tests.feature ................. SUCCESS [  1.658 s]
[INFO] org.eclipse.wst.tests.feature ..................... SUCCESS [  2.163 s]
[INFO] org.eclipse.wtp.requiredpreques ................... SUCCESS [  1.854 s]
[INFO] org.eclipse.wtp.xml.dev ........................... SUCCESS [  2.239 s]
[INFO] org.eclipse.wtp.xml.dev.assembly.feature .......... SUCCESS [  2.114 s]
[INFO] org.uddi4j.feature ................................ SUCCESS [  2.621 s]
[INFO] org.eclipse.jst ................................... SUCCESS [  2.349 s]
[INFO] org.eclipse.wst ................................... SUCCESS [  2.135 s]
[INFO] org.eclipse.wst.doc.isv.feature ................... SUCCESS [  2.475 s]
[INFO] org.eclipse.wst.doc.user.feature .................. SUCCESS [  2.148 s]
[INFO] org.eclipse.wtp.epp.package.jee.intro ............. SUCCESS [  4.843 s]
[INFO] org.eclipse.wtp.epp.package.capabilities .......... SUCCESS [  2.258 s]
[INFO] org.eclipse.wtp.javascript.capabilities ........... SUCCESS [  2.278 s]
[INFO] org.eclipse.wtp.jee.capabilities .................. SUCCESS [  2.259 s]
[INFO] org.eclipse.wtp.web.capabilities .................. SUCCESS [  2.055 s]
[INFO] org.eclipse.wtp.xml.capabilities .................. SUCCESS [  2.322 s]
[INFO] org.eclipse.wtp.capabilities.feature .............. SUCCESS [  1.871 s]
[INFO] org.eclipse.wtp.capabilities ...................... SUCCESS [  1.793 s]
[INFO] org.eclipse.wtp.feature.branding.template ......... SUCCESS [  2.104 s]
[INFO] org.eclipse.wtp.jee ............................... SUCCESS [  2.342 s]
[INFO] repositories ...................................... SUCCESS [  0.050 s]
[INFO] org.eclipse.webtools.dali ......................... SUCCESS [  0.053 s]
[INFO] org.eclipse.jpt.common.utility .................... SUCCESS [ 10.741 s]
[INFO] org.eclipse.jpt.common.core ....................... SUCCESS [  7.380 s]
[INFO] org.eclipse.jpt.common.ui ......................... SUCCESS [  7.065 s]
[INFO] org.eclipse.jpt.common.branding ................... SUCCESS [  2.099 s]
[INFO] org.eclipse.jpt.common.feature .................... SUCCESS [  2.861 s]
[INFO] org.eclipse.jpt.common_sdk.feature ................ SUCCESS [  2.060 s]
[INFO] org.eclipse.jpt.common.eclipselink.core ........... SUCCESS [  5.793 s]
[INFO] org.eclipse.jpt.common.eclipselink.branding ....... SUCCESS [  1.973 s]
[INFO] org.eclipse.jpt.common.eclipselink.feature ........ SUCCESS [  2.761 s]
[INFO] org.eclipse.jpt.common.eclipselink_sdk.feature .... SUCCESS [  5.362 s]
[INFO] org.eclipse.jpt.doc.isv ........................... SUCCESS [  2.087 s]
[INFO] org.eclipse.jpt.jpa.db ............................ SUCCESS [  4.921 s]
[INFO] org.eclipse.jpt.jpa.core .......................... SUCCESS [ 19.195 s]
[INFO] org.eclipse.jpt.jpa.annotate ...................... SUCCESS [  5.003 s]
[INFO] org.eclipse.jpt.jpa.db.ui ......................... SUCCESS [  4.387 s]
[INFO] org.eclipse.jpt.jpa.gen ........................... SUCCESS [  4.652 s]
[INFO] org.eclipse.jpt.jpa.ui ............................ SUCCESS [ 12.702 s]
[INFO] org.eclipse.jpt.doc.user .......................... SUCCESS [  6.019 s]
[INFO] org.eclipse.jpt.jpa.branding ...................... SUCCESS [  2.289 s]
[INFO] org.eclipse.jpt.jpa.feature ....................... SUCCESS [  2.406 s]
[INFO] org.eclipse.jpt.jpa_sdk.feature ................... SUCCESS [  2.008 s]
[INFO] org.eclipse.jpt.jpa.eclipselink.core .............. SUCCESS [ 13.879 s]
[INFO] org.eclipse.jpt.jpa.eclipselink.core.ddlgen ....... SUCCESS [  4.263 s]
[INFO] org.eclipse.jpt.jpa.eclipselink.ui ................ SUCCESS [  9.352 s]
[INFO] org.eclipse.jpt.jpa.eclipselink.branding .......... SUCCESS [  2.354 s]
[INFO] org.eclipse.jpt.jpa.eclipselink.feature ........... SUCCESS [  3.868 s]
[INFO] org.eclipse.jpt.jpa.eclipselink_sdk.feature ....... SUCCESS [  2.276 s]
[INFO] org.eclipse.jpt.jaxb.core ......................... SUCCESS [  7.966 s]
[INFO] org.eclipse.jpt.jaxb.core.schemagen ............... SUCCESS [  4.010 s]
[INFO] org.eclipse.jpt.jaxb.ui ........................... SUCCESS [  5.513 s]
[INFO] org.eclipse.jpt.jaxb.branding ..................... SUCCESS [  2.213 s]
[INFO] org.eclipse.jpt.jaxb.feature ...................... SUCCESS [  2.326 s]
[INFO] org.eclipse.jpt.jaxb_sdk.feature .................. SUCCESS [  2.075 s]
[INFO] org.eclipse.jpt.jaxb.eclipselink.core ............. SUCCESS [  6.698 s]
[INFO] org.eclipse.jpt.jaxb.eclipselink.core.schemagen ... SUCCESS [  4.200 s]
[INFO] org.eclipse.jpt.jaxb.eclipselink.ui ............... SUCCESS [  4.136 s]
[INFO] org.eclipse.jpt.jaxb.eclipselink.branding ......... SUCCESS [  1.986 s]
[INFO] org.eclipse.jpt.jaxb.eclipselink.feature .......... SUCCESS [  2.487 s]
[INFO] org.eclipse.jpt.jaxb.eclipselink_sdk.feature ...... SUCCESS [  1.923 s]
[INFO] org.eclipse.jpt.dbws.eclipselink.core.gen ......... SUCCESS [  3.705 s]
[INFO] org.eclipse.jpt.dbws.eclipselink.ui ............... SUCCESS [  5.083 s]
[INFO] org.eclipse.jpt.dbws.eclipselink.branding ......... SUCCESS [  1.943 s]
[INFO] org.eclipse.jpt.dbws.eclipselink.feature .......... SUCCESS [  2.860 s]
[INFO] org.eclipse.jpt.dbws.eclipselink_sdk.feature ...... SUCCESS [  1.796 s]
[INFO] JPA Diagram Editor Branding Plug-in ............... SUCCESS [  3.986 s]
[INFO] JPA Diagram Editor Plug-in ........................ SUCCESS [  7.506 s]
[INFO] JPA Diagram Editor Branding Plug-in ............... SUCCESS [  2.226 s]
[INFO] JPA Diagram Editor Feature ........................ SUCCESS [  2.681 s]
[INFO] org.eclipse.jpt.jpadiagrameditor_sdk.feature ...... SUCCESS [  2.013 s]
[INFO] dali4x-sdk ........................................ SUCCESS [ 14.339 s]
[INFO] org.eclipse.jpt.common.utility.tests .............. SUCCESS [02:32 min]
[INFO] org.eclipse.jpt.common.core.tests ................. SUCCESS [ 48.464 s]
[INFO] org.eclipse.jpt.common.tests.feature .............. SUCCESS [  2.733 s]
[INFO] org.eclipse.jpt.jpa.core.tests.extension.resource . SUCCESS [  4.317 s]
[INFO] org.eclipse.jpt.jpa.core.tests .................... SUCCESS [28:40 min]
[INFO] org.eclipse.jpt.jpa.tests.feature ................. SUCCESS [  1.969 s]
[INFO] org.eclipse.jpt.jpa.eclipselink.core.tests ........ SUCCESS [ 16.615 s]
[INFO] org.eclipse.jpt.jpa.eclipselink.tests.feature ..... SUCCESS [  2.147 s]
[INFO] org.eclipse.jpt.jaxb.core.tests ................... SUCCESS [05:01 min]
[INFO] org.eclipse.jpt.jaxb.tests.feature ................ SUCCESS [  2.181 s]
[INFO] org.eclipse.jpt.jaxb.eclipselink.core.tests ....... SUCCESS [ 16.339 s]
[INFO] org.eclipse.jpt.jaxb.eclipselink.tests.feature .... SUCCESS [  1.780 s]
[INFO] JPA Diagram Editor Test Plug-in ................... SUCCESS [ 59.598 s]
[INFO] org.eclipse.jpt.jpadiagrameditor.tests.feature .... SUCCESS [  1.871 s]
[INFO] dali4x.tests ...................................... SUCCESS [  4.049 s]
[INFO] jst4x-sdk ......................................... FAILURE [  0.138 s]
[INFO] jst4x.tests ....................................... SUCCESS [ 12.720 s]
[INFO] wst4x-sdk ......................................... SUCCESS [  8.735 s]
[INFO] wst4x.tests ....................................... SUCCESS [  3.842 s]
[INFO] repository ........................................ FAILURE [  0.710 s]
[INFO] repositoryunittests ............................... SUCCESS [  9.543 s]
[INFO] org.eclipse.jpt.assembly.feature .................. SUCCESS [  1.861 s]
[INFO] org.eclipse.jpt_sdk.assembly.feature .............. SUCCESS [  1.877 s]
[INFO] org.eclipse.jpt.tests.assembly.feature ............ SUCCESS [  2.075 s]
[INFO] JPA Editor Update Site ............................ SUCCESS [  3.268 s]
[INFO] org.eclipse.jst.doc.user.feature .................. SUCCESS [  2.123 s]
[INFO] org.eclipse.jsf.assembly.feature .................. SUCCESS [  1.627 s]
[INFO] org.eclipse.jst.jsf.doc.feature ................... SUCCESS [  1.600 s]
[INFO] org.eclipse.wst.server.http.core.tests ............ SUCCESS [  5.037 s]
[INFO] org.eclipse.wst.server.util.tests ................. SUCCESS [  3.809 s]
[INFO] PsychoPath XPath 2.0 Processor: SDK Documentation . SUCCESS [  5.039 s]
[INFO] PsychoPath XPath 2.0 Processor: SDK Feature ....... SUCCESS [  1.616 s]
[INFO] PsychoPath XPath 2.0 Processor: Tests for WTP type support  SUCCESS [  9.177 s]
[INFO] org.eclipse.jst.ws.jaxws.assembly.feature ......... SUCCESS [  1.628 s]
[INFO] wtp-aggregator .................................... SUCCESS [  0.104 s]
[INFO] ------------------------------------------------------------------------
[INFO] BUILD FAILURE
[INFO] ------------------------------------------------------------------------
[INFO] Total time: 02:41 h
[INFO] Finished at: 2014-10-16T14:33:20-05:00
[INFO] Final Memory: 740M/3531M
[INFO] ------------------------------------------------------------------------
[INFO] o.h.m.e.h.MavenExecutionResultHandler - Build failed with exception(s)
[INFO] o.h.m.e.h.MavenExecutionResultHandler - [1] org.apache.maven.lifecycle.LifecycleExecutionException: Failed to execute goal org.eclipse.tycho:tycho-packaging-plugin:0.20.0:validate-version (default-validate-version) on project org.eclipse.jst.ws.axis2tools.feature: Unqualified OSGi version 1.1.301.qualifier must match unqualified Maven version 1.1.300-SNAPSHOT for SNAPSHOT builds
[INFO] o.h.m.e.h.MavenExecutionResultHandler - [2] org.apache.maven.lifecycle.LifecycleExecutionException: Failed to execute goal on project org.eclipse.jst.ws.axis2tools_sdk.feature: Could not resolve dependencies for project org.eclipse.webtools.webservices:org.eclipse.jst.ws.axis2tools_sdk.feature:eclipse-feature:1.1.300-SNAPSHOT: Could not find artifact org.eclipse.webtools.webservices:org.eclipse.jst.ws.axis2tools.feature:jar:1.1.300-SNAPSHOT
[INFO] o.h.m.e.h.MavenExecutionResultHandler - [3] org.apache.maven.lifecycle.LifecycleExecutionException: Failed to execute goal on project org.eclipse.jst.sdk: Could not resolve dependencies for project org.eclipse.webtools.releng:org.eclipse.jst.sdk:eclipse-feature:3.6.0-SNAPSHOT: The following artifacts could not be resolved: org.eclipse.webtools.webservices:org.eclipse.jst.ws.axis2tools_sdk.feature:jar:1.1.300-SNAPSHOT, org.eclipse.webtools.webservices:org.eclipse.jst.ws.axis2tools.feature:jar:1.1.300-SNAPSHOT: Could not find artifact org.eclipse.webtools.webservices:org.eclipse.jst.ws.axis2tools_sdk.feature:jar:1.1.300-SNAPSHOT
[INFO] o.h.m.e.h.MavenExecutionResultHandler - [4] org.apache.maven.lifecycle.LifecycleExecutionException: Failed to execute goal org.eclipse.tycho:tycho-surefire-plugin:0.20.0:test (default-test) on project org.eclipse.jst.server.core.tests: An unexpected error occured (return code 143). See log for details.
[INFO] o.h.m.e.h.MavenExecutionResultHandler - [5] org.apache.maven.lifecycle.LifecycleExecutionException: Failed to execute goal org.eclipse.tycho:tycho-surefire-plugin:0.20.0:test (default-test) on project org.eclipse.wst.wsdl.tests: An unexpected error occured (return code 13). See log for details.
[INFO] o.h.m.e.h.MavenExecutionResultHandler - [6] org.apache.maven.lifecycle.LifecycleExecutionException: Failed to execute goal org.eclipse.tycho:tycho-packaging-plugin:0.20.0:build-qualifier-aggregator (default-build-qualifier-aggregator) on project jst4x-sdk: Execution default-build-qualifier-aggregator of goal org.eclipse.tycho:tycho-packaging-plugin:0.20.0:build-qualifier-aggregator failed: Project org.eclipse.webtools.webservices:org.eclipse.jst.ws.axis2tools_sdk.feature:eclipse-feature:1.1.300-SNAPSHOT does not have expanded version
[INFO] o.h.m.e.h.MavenExecutionResultHandler - [7] org.apache.maven.lifecycle.LifecycleExecutionException: Failed to execute goal org.eclipse.tycho.extras:tycho-p2-extras-plugin:0.20.0:mirror (default) on project repository: Error during mirroring
[DEBUG] Closing connection to remote
[ERROR] Failed to execute goal org.eclipse.tycho:tycho-packaging-plugin:0.20.0:validate-version (default-validate-version) on project org.eclipse.jst.ws.axis2tools.feature: Unqualified OSGi version 1.1.301.qualifier must match unqualified Maven version 1.1.300-SNAPSHOT for SNAPSHOT builds -> [Help 1]
[ERROR] Failed to execute goal on project org.eclipse.jst.ws.axis2tools_sdk.feature: Could not resolve dependencies for project org.eclipse.webtools.webservices:org.eclipse.jst.ws.axis2tools_sdk.feature:eclipse-feature:1.1.300-SNAPSHOT: Could not find artifact org.eclipse.webtools.webservices:org.eclipse.jst.ws.axis2tools.feature:jar:1.1.300-SNAPSHOT -> [Help 2]
[ERROR] Failed to execute goal on project org.eclipse.jst.sdk: Could not resolve dependencies for project org.eclipse.webtools.releng:org.eclipse.jst.sdk:eclipse-feature:3.6.0-SNAPSHOT: The following artifacts could not be resolved: org.eclipse.webtools.webservices:org.eclipse.jst.ws.axis2tools_sdk.feature:jar:1.1.300-SNAPSHOT, org.eclipse.webtools.webservices:org.eclipse.jst.ws.axis2tools.feature:jar:1.1.300-SNAPSHOT: Could not find artifact org.eclipse.webtools.webservices:org.eclipse.jst.ws.axis2tools_sdk.feature:jar:1.1.300-SNAPSHOT -> [Help 2]
[ERROR] Failed to execute goal org.eclipse.tycho:tycho-surefire-plugin:0.20.0:test (default-test) on project org.eclipse.jst.server.core.tests: An unexpected error occured (return code 143). See log for details. -> [Help 3]
[ERROR] Failed to execute goal org.eclipse.tycho:tycho-surefire-plugin:0.20.0:test (default-test) on project org.eclipse.wst.wsdl.tests: An unexpected error occured (return code 13). See log for details. -> [Help 3]
[ERROR] Failed to execute goal org.eclipse.tycho:tycho-packaging-plugin:0.20.0:build-qualifier-aggregator (default-build-qualifier-aggregator) on project jst4x-sdk: Execution default-build-qualifier-aggregator of goal org.eclipse.tycho:tycho-packaging-plugin:0.20.0:build-qualifier-aggregator failed: Project org.eclipse.webtools.webservices:org.eclipse.jst.ws.axis2tools_sdk.feature:eclipse-feature:1.1.300-SNAPSHOT does not have expanded version -> [Help 4]
[ERROR] Failed to execute goal org.eclipse.tycho.extras:tycho-p2-extras-plugin:0.20.0:mirror (default) on project repository: Error during mirroring: Mirroring failed: No repository found at file:/jobs/genie.webtools/WTP-R3_7_Integration/workspace/webtools.repositories/repository//../jst4x-sdk/target/repository. -> [Help 1]
[ERROR] 
[ERROR] To see the full stack trace of the errors, re-run Maven with the -e switch.
[ERROR] Re-run Maven using the -X switch to enable full debug logging.
[ERROR] 
[ERROR] For more information about the errors and possible solutions, please read the following articles:
[ERROR] [Help 1] http://cwiki.apache.org/confluence/display/MAVEN/MojoExecutionException
[ERROR] [Help 2] http://cwiki.apache.org/confluence/display/MAVEN/DependencyResolutionException
[ERROR] [Help 3] http://cwiki.apache.org/confluence/display/MAVEN/MojoFailureException
[ERROR] [Help 4] http://cwiki.apache.org/confluence/display/MAVEN/PluginExecutionException
[ERROR] 
[ERROR] After correcting the problems, you can resume the build with the command
[ERROR]   mvn <goals> -rf :org.eclipse.jst.ws.axis2tools.feature
[INFO] Build failures were ignored.
[DEBUG] Waiting for process to finish
[DEBUG] Result: 0
[wtp-parent] $ /shared/common/apache-ant-1.8.4/bin/ant -file postBuild.xml -Dpublish=true -Dbuild.type=I -lib ./libs/
Buildfile: /jobs/genie.webtools/WTP-R3_7_Integration/workspace/wtp-parent/postBuild.xml

main:
     [echo] Starting the publishing...

init:

BUILD FAILED
/jobs/genie.webtools/WTP-R3_7_Integration/workspace/wtp-parent/postBuild.xml:394: The following error occurred while executing this line:
/jobs/genie.webtools/WTP-R3_7_Integration/workspace/wtp-parent/postBuild.xml:68: The repository ZIP file does not exist. It is not possible to continue the publishing.

Total time: 0 seconds
Terminating xvnc.
Archiving artifacts
Recording test results

--
This message is automatically generated by Hudson. 
For more information on Hudson, see: http://hudson-ci.org/


Back to the top