Skip to main content

[Date Prev][Date Next][Thread Prev][Thread Next][Date Index][Thread Index] [List Home]
[virgo-build] [Hudson] Build failed in Hudson: virgo.packaging.snapshot #25

See <https://hudson.eclipse.org/hudson/job/virgo.packaging.snapshot/25/>

------------------------------------------
[...truncated 3236 lines...]
    [junit] Aug 24, 2012 9:29:53 PM ClientCommunicatorAdmin restart
    [junit] WARNING: Failed to restart: java.io.IOException: Failed to get a RMI stub: javax.naming.ServiceUnavailableException [Root exception is java.rmi.ConnectException: Connection refused to host: localhost; nested exception is: 
    [junit] 	java.net.ConnectException: Connection refused]
    [junit] Aug 24, 2012 9:29:53 PM RMIConnector RMIClientCommunicatorAdmin-doStop
    [junit] WARNING: Failed to call the method close():java.rmi.ConnectException: Connection refused to host: 127.0.0.2; nested exception is: 
    [junit] 	java.net.ConnectException: Connection refused
    [junit] Aug 24, 2012 9:29:53 PM ClientCommunicatorAdmin Checker-run
    [junit] WARNING: Failed to check connection: java.net.ConnectException: Connection refused
    [junit] Aug 24, 2012 9:29:53 PM ClientCommunicatorAdmin Checker-run
    [junit] WARNING: stopping
    [junit] Aug 24, 2012 9:29:53 PM ClientCommunicatorAdmin restart
    [junit] WARNING: Failed to restart: java.io.IOException: Failed to get a RMI stub: javax.naming.ServiceUnavailableException [Root exception is java.rmi.ConnectException: Connection refused to host: localhost; nested exception is: 
    [junit] 	java.net.ConnectException: Connection refused]
    [junit] Aug 24, 2012 9:29:53 PM RMIConnector RMIClientCommunicatorAdmin-doStop
    [junit] WARNING: Failed to call the method close():java.rmi.ConnectException: Connection refused to host: 127.0.0.2; nested exception is: 
    [junit] 	java.net.ConnectException: Connection refused
    [junit] Aug 24, 2012 9:29:53 PM ClientCommunicatorAdmin Checker-run
    [junit] WARNING: Failed to check connection: java.net.ConnectException: Connection refused
    [junit] Aug 24, 2012 9:29:53 PM ClientCommunicatorAdmin Checker-run
    [junit] WARNING: stopping
    [junit] ------------- ---------------- ---------------
   [subant] Leaving directory: <https://hudson.eclipse.org/hudson/job/virgo.packaging.snapshot/ws/build-packaging/nano/org.eclipse.virgo.nano.smoketest>

test.post:
    [mkdir] Created dir: <https://hudson.eclipse.org/hudson/job/virgo.packaging.snapshot/ws/build-packaging/target/test-results/html>
[junitreport] Processing <https://hudson.eclipse.org/hudson/job/virgo.packaging.snapshot/ws/build-packaging/TESTS-TestSuites.xml> to /tmp/null1782334182
[junitreport] Loading stylesheet jar:file:/shared/common/apache-ant-1.8.2/lib/ant-junit.jar!/org/apache/tools/ant/taskdefs/optional/junit/xsl/junit-frames.xsl
[junitreport] Transform time: 160ms
[junitreport] Deleting: /tmp/null1782334182
   [delete] Deleting: <https://hudson.eclipse.org/hudson/job/virgo.packaging.snapshot/ws/build-packaging/TESTS-TestSuites.xml>

smoke-test-kernel:

test.pre:
   [delete] Deleting directory <https://hudson.eclipse.org/hudson/job/virgo.packaging.snapshot/ws/build-packaging/target/test-results>
    [mkdir] Created dir: <https://hudson.eclipse.org/hudson/job/virgo.packaging.snapshot/ws/build-packaging/target/test-results/xml>
   [subant] Entering directory: <https://hudson.eclipse.org/hudson/job/virgo.packaging.snapshot/ws/build-packaging/kernel/org.eclipse.virgo.kernel.smoketest>

test-package:

unzip.package:
   [delete] Deleting directory <https://hudson.eclipse.org/hudson/job/virgo.packaging.snapshot/ws/build-packaging/kernel/org.eclipse.virgo.kernel.smoketest/target/test-expanded>
    [mkdir] Created dir: <https://hudson.eclipse.org/hudson/job/virgo.packaging.snapshot/ws/build-packaging/kernel/org.eclipse.virgo.kernel.smoketest/target/test-expanded>
    [unzip] Expanding: <https://hudson.eclipse.org/hudson/job/virgo.packaging.snapshot/ws/build-packaging/target/artifacts/virgo-kernel-3.6.0.CI-2012-08-24_20-52-58.zip> into <https://hudson.eclipse.org/hudson/job/virgo.packaging.snapshot/ws/build-packaging/kernel/org.eclipse.virgo.kernel.smoketest/target/test-expanded>

ivy.init:

ivy.file.exists:

resolve.init:

resolve.compile:
[ivy:cachepath] :: Ivy 2.1.0 - 20090925235825 :: http://ant.apache.org/ivy/ ::
[ivy:cachepath] :: loading settings :: file = <https://hudson.eclipse.org/hudson/job/virgo.packaging.snapshot/ws/virgo-build/common/ivysettings.xml>

resolve.test:

compile.init:

test.init:
   [delete] Deleting: <https://hudson.eclipse.org/hudson/job/virgo.packaging.snapshot/ws/build-packaging/kernel/user-ivy.properties>

test.do:
   [delete] Deleting directory <https://hudson.eclipse.org/hudson/job/virgo.packaging.snapshot/ws/build-packaging/kernel/org.eclipse.virgo.kernel.smoketest/target/test-classes>
    [mkdir] Created dir: <https://hudson.eclipse.org/hudson/job/virgo.packaging.snapshot/ws/build-packaging/kernel/org.eclipse.virgo.kernel.smoketest/target/test-classes>
  [s:javac] Compiling 2 source files to <https://hudson.eclipse.org/hudson/job/virgo.packaging.snapshot/ws/build-packaging/kernel/org.eclipse.virgo.kernel.smoketest/target/test-classes>
    [junit] Testsuite: org.eclipse.virgo.kernel.smoketest.KernelStartupAndShutdownTests
    [junit] Tests run: 2, Failures: 0, Errors: 0, Time elapsed: 35.26 sec
    [junit] 
    [junit] ------------- Standard Output ---------------
    [junit] SLF4J: The following loggers will not work because they were created
    [junit] SLF4J: during the default configuration phase of the underlying logging system.
    [junit] SLF4J: See also http://www.slf4j.org/codes.html#substituteLogger
    [junit] SLF4J: sun.rmi.transport.tcp
    [junit] SLF4J: sun.rmi.transport.tcp
    [junit] SLF4J: sun.rmi.loader
    [junit] SLF4J: sun.rmi.loader
    [junit] SLF4J: sun.rmi.loader
    [junit] SLF4J: sun.rmi.loader
    [junit] SLF4J: sun.rmi.loader
    [junit] SLF4J: sun.rmi.loader
    [junit] SLF4J: sun.rmi.transport.tcp
    [junit] SLF4J: sun.rmi.transport.tcp
    [junit] SLF4J: sun.rmi.transport.tcp
    [junit] SLF4J: sun.rmi.loader
    [junit] SLF4J: sun.rmi.server.call
    [junit] SLF4J: sun.rmi.transport.tcp
    [junit] SLF4J: sun.rmi.transport.tcp
    [junit] SLF4J: sun.rmi.transport.tcp
    [junit] SLF4J: sun.rmi.transport.tcp
    [junit] SLF4J: sun.rmi.loader
    [junit] SLF4J: sun.rmi.transport.tcp
    [junit] SLF4J: sun.rmi.loader
    [junit] SLF4J: sun.rmi.loader
    [junit] SLF4J: sun.rmi.loader
    [junit] SLF4J: sun.rmi.loader
    [junit] SLF4J: sun.rmi.loader
    [junit] SLF4J: sun.rmi.loader
    [junit] SLF4J: sun.rmi.transport.tcp
    [junit] SLF4J: sun.rmi.transport.tcp
    [junit] SLF4J: sun.rmi.transport.tcp
    [junit] SLF4J: sun.rmi.loader
    [junit] SLF4J: sun.rmi.server.call
    [junit] SLF4J: sun.rmi.transport.tcp
    [junit] SLF4J: sun.rmi.transport.tcp
    [junit] SLF4J: sun.rmi.transport.tcp
    [junit] SLF4J: sun.rmi.transport.tcp
    [junit] SLF4J: sun.rmi.transport.tcp
    [junit] SLF4J: sun.rmi.loader
    [junit] SLF4J: sun.rmi.transport.tcp
    [junit] SLF4J: sun.rmi.loader
    [junit] SLF4J: sun.rmi.loader
    [junit] SLF4J: sun.rmi.loader
    [junit] SLF4J: sun.rmi.loader
    [junit] SLF4J: sun.rmi.loader
    [junit] SLF4J: sun.rmi.loader
    [junit] SLF4J: sun.rmi.transport.tcp
    [junit] SLF4J: sun.rmi.transport.tcp
    [junit] SLF4J: sun.rmi.transport.tcp
    [junit] SLF4J: sun.rmi.loader
    [junit] SLF4J: sun.rmi.server.call
    [junit] SLF4J: sun.rmi.transport.tcp
    [junit] SLF4J: sun.rmi.transport.tcp
    [junit] SLF4J: sun.rmi.transport.tcp
    [junit] SLF4J: sun.rmi.transport.tcp
    [junit] SLF4J: sun.rmi.transport.tcp
    [junit] SLF4J: sun.rmi.transport.tcp
    [junit] SLF4J: sun.rmi.loader
    [junit] SLF4J: sun.rmi.transport.tcp
    [junit] SLF4J: sun.rmi.loader
    [junit] SLF4J: sun.rmi.loader
    [junit] SLF4J: sun.rmi.loader
    [junit] SLF4J: sun.rmi.loader
    [junit] SLF4J: sun.rmi.loader
    [junit] SLF4J: sun.rmi.loader
    [junit] SLF4J: sun.rmi.transport.tcp
    [junit] SLF4J: sun.rmi.transport.tcp
    [junit] SLF4J: sun.rmi.transport.tcp
    [junit] SLF4J: sun.rmi.loader
    [junit] SLF4J: sun.rmi.server.call
    [junit] [2012-08-24 21:30:12.628] startup-tracker              <KE0001I> Kernel starting. 
    [junit] [2012-08-24 21:30:18.178] startup-tracker              <KE0002I> Kernel started. 
    [junit] [2012-08-24 21:30:18.520] system-artifacts             <DE0000I> Installing plan 'org.eclipse.virgo.kernel.userregion.blueprint' version '3.6.0'. 
    [junit] [2012-08-24 21:30:18.702] system-artifacts             <DE0000I> Installing bundle 'org.eclipse.gemini.blueprint.core' version '1.0.0.RELEASE'. 
    [junit] [2012-08-24 21:30:18.748] system-artifacts             <DE0000I> Installing bundle 'org.eclipse.gemini.blueprint.extender' version '1.0.0.RELEASE'. 
    [junit] [2012-08-24 21:30:18.760] system-artifacts             <DE0000I> Installing bundle 'org.eclipse.gemini.blueprint.io' version '1.0.0.RELEASE'. 
    [junit] [2012-08-24 21:30:18.771] system-artifacts             <DE0000I> Installing bundle 'org.eclipse.virgo.kernel.agent.dm' version '3.6.0.D-20120823180814'. 
    [junit] [2012-08-24 21:30:18.780] system-artifacts             <DE0000I> Installing bundle 'org.eclipse.virgo.kernel.deployer.dm' version '3.6.0.D-20120823180814'. 
    [junit] [2012-08-24 21:30:18.807] system-artifacts             <DE0000I> Installing bundle 'org.eclipse.equinox.ds' version '1.4.0.v20120112-1400'. 
    [junit] [2012-08-24 21:30:18.834] system-artifacts             <DE0000I> Installing bundle 'org.eclipse.equinox.util' version '1.0.300.v20111010-1614'. 
    [junit] [2012-08-24 21:30:18.842] system-artifacts             <DE0000I> Installing configuration 'osgi.console' version '0.0.0'. 
    [junit] [2012-08-24 21:30:19.390] system-artifacts             <DE0001I> Installed bundle 'org.eclipse.gemini.blueprint.core' version '1.0.0.RELEASE'. 
    [junit] [2012-08-24 21:30:19.394] system-artifacts             <DE0001I> Installed bundle 'org.eclipse.gemini.blueprint.extender' version '1.0.0.RELEASE'. 
    [junit] [2012-08-24 21:30:19.395] system-artifacts             <DE0001I> Installed bundle 'org.eclipse.gemini.blueprint.io' version '1.0.0.RELEASE'. 
    [junit] [2012-08-24 21:30:19.397] system-artifacts             <DE0001I> Installed bundle 'org.eclipse.virgo.kernel.agent.dm' version '3.6.0.D-20120823180814'. 
    [junit] [2012-08-24 21:30:19.399] system-artifacts             <DE0001I> Installed bundle 'org.eclipse.virgo.kernel.deployer.dm' version '3.6.0.D-20120823180814'. 
    [junit] [2012-08-24 21:30:19.400] system-artifacts             <DE0001I> Installed bundle 'org.eclipse.equinox.ds' version '1.4.0.v20120112-1400'. 
    [junit] [2012-08-24 21:30:19.402] system-artifacts             <DE0001I> Installed bundle 'org.eclipse.equinox.util' version '1.0.300.v20111010-1614'. 
    [junit] [2012-08-24 21:30:19.404] system-artifacts             <DE0001I> Installed configuration 'osgi.console' version '0.0.0'. 
    [junit] [2012-08-24 21:30:19.406] system-artifacts             <DE0001I> Installed plan 'org.eclipse.virgo.kernel.userregion.blueprint' version '3.6.0'. 
    [junit] [2012-08-24 21:30:19.444] system-artifacts             <DE0004I> Starting plan 'org.eclipse.virgo.kernel.userregion.blueprint' version '3.6.0'. 
    [junit] [2012-08-24 21:30:19.452] system-artifacts             <DE0004I> Starting bundle 'org.eclipse.gemini.blueprint.core' version '1.0.0.RELEASE'. 
    [junit] [2012-08-24 21:30:19.463] start-signalling-1           <DE0005I> Started bundle 'org.eclipse.gemini.blueprint.core' version '1.0.0.RELEASE'. 
    [junit] [2012-08-24 21:30:19.466] system-artifacts             <DE0004I> Starting bundle 'org.eclipse.gemini.blueprint.extender' version '1.0.0.RELEASE'. 
    [junit] [2012-08-24 21:30:19.992] start-signalling-1           <DE0005I> Started bundle 'org.eclipse.gemini.blueprint.extender' version '1.0.0.RELEASE'. 
    [junit] [2012-08-24 21:30:19.994] system-artifacts             <DE0004I> Starting bundle 'org.eclipse.gemini.blueprint.io' version '1.0.0.RELEASE'. 
    [junit] [2012-08-24 21:30:19.999] start-signalling-1           <DE0005I> Started bundle 'org.eclipse.gemini.blueprint.io' version '1.0.0.RELEASE'. 
    [junit] [2012-08-24 21:30:20.001] system-artifacts             <DE0004I> Starting bundle 'org.eclipse.virgo.kernel.agent.dm' version '3.6.0.D-20120823180814'. 
    [junit] [2012-08-24 21:30:20.005] start-signalling-1           <DE0005I> Started bundle 'org.eclipse.virgo.kernel.agent.dm' version '3.6.0.D-20120823180814'. 
    [junit] [2012-08-24 21:30:20.008] system-artifacts             <DE0004I> Starting bundle 'org.eclipse.virgo.kernel.deployer.dm' version '3.6.0.D-20120823180814'. 
    [junit] [2012-08-24 21:30:20.030] system-artifacts             <DE0004I> Starting bundle 'org.eclipse.equinox.ds' version '1.4.0.v20120112-1400'. 
    [junit] [2012-08-24 21:30:20.188] start-signalling-1           <DE0005I> Started bundle 'org.eclipse.equinox.ds' version '1.4.0.v20120112-1400'. 
    [junit] [2012-08-24 21:30:20.189] system-artifacts             <DE0004I> Starting bundle 'org.eclipse.equinox.util' version '1.0.300.v20111010-1614'. 
    [junit] [2012-08-24 21:30:20.210] system-artifacts             <DE0004I> Starting configuration 'osgi.console' version '0.0.0'. 
    [junit] [2012-08-24 21:30:20.215] start-signalling-1           <DE0005I> Started bundle 'org.eclipse.equinox.util' version '1.0.300.v20111010-1614'. 
    [junit] [2012-08-24 21:30:20.220] start-signalling-1           <DE0005I> Started bundle 'org.eclipse.virgo.kernel.deployer.dm' version '3.6.0.D-20120823180814'. 
    [junit] [2012-08-24 21:30:20.247] system-artifacts             <DE0005I> Started configuration 'osgi.console' version '0.0.0'. 
    [junit] [2012-08-24 21:30:20.249] system-artifacts             <DE0005I> Started plan 'org.eclipse.virgo.kernel.userregion.blueprint' version '3.6.0'. 
    [junit] [2012-08-24 21:30:20.396] system-artifacts             <DE0000I> Installing plan 'org.eclipse.virgo.management.console' version '3.6.0'. 
    [junit] [2012-08-24 21:30:20.454] system-artifacts             <DE0000I> Installing bundle 'osgi.enterprise' version '4.2.0.v201108120515'. 
    [junit] [2012-08-24 21:30:20.476] system-artifacts             <DE0000I> Installing bundle 'org.eclipse.gemini.management' version '1.0.3.RELEASE'. 
    [junit] [2012-08-24 21:30:20.483] system-artifacts             <DE0000I> Installing bundle 'org.eclipse.virgo.management.fragment' version '3.6.0.CI-2012-08-23_09-51-47'. 
    [junit] [2012-08-24 21:30:20.700] system-artifacts             <DE0001I> Installed bundle 'osgi.enterprise' version '4.2.0.v201108120515'. 
    [junit] [2012-08-24 21:30:20.701] system-artifacts             <DE0001I> Installed bundle 'org.eclipse.gemini.management' version '1.0.3.RELEASE'. 
    [junit] [2012-08-24 21:30:20.703] system-artifacts             <DE0001I> Installed bundle 'org.eclipse.virgo.management.fragment' version '3.6.0.CI-2012-08-23_09-51-47'. 
    [junit] [2012-08-24 21:30:20.704] system-artifacts             <DE0001I> Installed plan 'org.eclipse.virgo.management.console' version '3.6.0'. 
    [junit] [2012-08-24 21:30:20.728] system-artifacts             <DE0004I> Starting plan 'org.eclipse.virgo.management.console' version '3.6.0'. 
    [junit] [2012-08-24 21:30:20.730] system-artifacts             <DE0004I> Starting bundle 'osgi.enterprise' version '4.2.0.v201108120515'. 
    [junit] [2012-08-24 21:30:20.759] start-signalling-1           <DE0005I> Started bundle 'osgi.enterprise' version '4.2.0.v201108120515'. 
    [junit] [2012-08-24 21:30:20.762] system-artifacts             <DE0004I> Starting bundle 'org.eclipse.gemini.management' version '1.0.3.RELEASE'. 
    [junit] [2012-08-24 21:30:20.773] system-artifacts             <DE0005I> Started bundle 'org.eclipse.virgo.management.fragment' version '3.6.0.CI-2012-08-23_09-51-47'. 
    [junit] [2012-08-24 21:30:20.782] start-signalling-1           <DE0005I> Started bundle 'org.eclipse.gemini.management' version '1.0.3.RELEASE'. 
    [junit] [2012-08-24 21:30:20.784] start-signalling-1           <DE0005I> Started plan 'org.eclipse.virgo.management.console' version '3.6.0'. 
    [junit] [2012-08-24 21:30:20.788] sync Event Dispatcher Thread <UR0001I> User region ready. 
    [junit] [2012-08-24 21:30:21.859] fs-watcher                   <HD0001I> Hot deployer processing 'INITIAL' event for file 'org.eclipse.virgo.management.console_3.6.0.D-20120823180814.jar'. 
    [junit] [2012-08-24 21:30:21.997] fs-watcher                   <DE0000I> Installing bundle 'org.eclipse.virgo.management.console' version '3.6.0.D-20120823180814'. 
    [junit] [2012-08-24 21:30:22.069] fs-watcher                   <DE0001I> Installed bundle 'org.eclipse.virgo.management.console' version '3.6.0.D-20120823180814'. 
    [junit] [2012-08-24 21:30:22.078] fs-watcher                   <DE0004I> Starting bundle 'org.eclipse.virgo.management.console' version '3.6.0.D-20120823180814'. 
    [junit] [2012-08-24 21:30:22.234] start-signalling-1           <DE0005I> Started bundle 'org.eclipse.virgo.management.console' version '3.6.0.D-20120823180814'. 
    [junit] [2012-08-24 21:30:41.883] System Bundle Shutdown       <KE0010I> Shutdown initiated. 
    [junit] ------------- ---------------- ---------------
   [subant] Leaving directory: <https://hudson.eclipse.org/hudson/job/virgo.packaging.snapshot/ws/build-packaging/kernel/org.eclipse.virgo.kernel.smoketest>

test.post:
    [mkdir] Created dir: <https://hudson.eclipse.org/hudson/job/virgo.packaging.snapshot/ws/build-packaging/target/test-results/html>
[junitreport] Processing <https://hudson.eclipse.org/hudson/job/virgo.packaging.snapshot/ws/build-packaging/TESTS-TestSuites.xml> to /tmp/null1295247016
[junitreport] Loading stylesheet jar:file:/shared/common/apache-ant-1.8.2/lib/ant-junit.jar!/org/apache/tools/ant/taskdefs/optional/junit/xsl/junit-frames.xsl
[junitreport] Transform time: 159ms
[junitreport] Deleting: /tmp/null1295247016
   [delete] Deleting: <https://hudson.eclipse.org/hudson/job/virgo.packaging.snapshot/ws/build-packaging/TESTS-TestSuites.xml>

smoke-test-tomcat-server:

test.pre:
   [delete] Deleting directory <https://hudson.eclipse.org/hudson/job/virgo.packaging.snapshot/ws/build-packaging/target/test-results>
    [mkdir] Created dir: <https://hudson.eclipse.org/hudson/job/virgo.packaging.snapshot/ws/build-packaging/target/test-results/xml>
   [subant] Entering directory: <https://hudson.eclipse.org/hudson/job/virgo.packaging.snapshot/ws/build-packaging/tomcat-server/org.eclipse.virgo.server.smoketest>

test-package:

unzip.package:
   [delete] Deleting directory <https://hudson.eclipse.org/hudson/job/virgo.packaging.snapshot/ws/build-packaging/tomcat-server/org.eclipse.virgo.server.smoketest/target/test-expanded>
    [mkdir] Created dir: <https://hudson.eclipse.org/hudson/job/virgo.packaging.snapshot/ws/build-packaging/tomcat-server/org.eclipse.virgo.server.smoketest/target/test-expanded>
    [unzip] Expanding: <https://hudson.eclipse.org/hudson/job/virgo.packaging.snapshot/ws/build-packaging/target/artifacts/virgo-tomcat-server-3.6.0.CI-2012-08-24_20-52-58.zip> into <https://hudson.eclipse.org/hudson/job/virgo.packaging.snapshot/ws/build-packaging/tomcat-server/org.eclipse.virgo.server.smoketest/target/test-expanded>

startup.pre:
     [copy] Copying 1 file to <https://hudson.eclipse.org/hudson/job/virgo.packaging.snapshot/ws/build-packaging/tomcat-server/org.eclipse.virgo.server.smoketest/target/test-expanded/virgo-tomcat-server-3.6.0.CI-2012-08-24_20-52-58/pickup>

shutdown:
     [echo] Shutting Down Virgo Server
     [echo] Shutting Down Virgo Server - waiting for http://localhost:8080/ to stop responding
     [echo] Shutting Down Virgo Server - shutdown

startup:
     [echo] Starting Up Virgo Server
     [echo] Starting Up Virgo Server - script run and waiting for response from http://localhost:8080/
   [subant] Leaving directory: <https://hudson.eclipse.org/hudson/job/virgo.packaging.snapshot/ws/build-packaging/tomcat-server/org.eclipse.virgo.server.smoketest>

BUILD FAILED
<https://hudson.eclipse.org/hudson/job/virgo.packaging.snapshot/ws/build-packaging/build.xml>:34: The following error occurred while executing this line:
<https://hudson.eclipse.org/hudson/job/virgo.packaging.snapshot/ws/build-packaging/tomcat-server/build-tomcat-server.xml>:178: The following error occurred while executing this line:
<https://hudson.eclipse.org/hudson/job/virgo.packaging.snapshot/ws/virgo-build/multi-bundle/common.xml>:156: The following error occurred while executing this line:
<https://hudson.eclipse.org/hudson/job/virgo.packaging.snapshot/ws/build-packaging/tomcat-server/test-package.xml>:12: The following error occurred while executing this line:
<https://hudson.eclipse.org/hudson/job/virgo.packaging.snapshot/ws/build-packaging/tomcat-server/test-package.xml>:52: Virgo Server start up failed

Total time: 11 minutes 3 seconds
[locks-and-latches] Releasing all the locks
[locks-and-latches] All the locks released
Archiving artifacts

--
This message is automatically generated by Hudson. 
For more information on Hudson, see: http://hudson-ci.org/


Back to the top