Skip to main content

[Date Prev][Date Next][Thread Prev][Thread Next][Date Index][Thread Index] [List Home]
[rdf4j-dev] Build failed in Jenkins: rdf4j-develop-deploy #91

See <https://ci.eclipse.org/rdf4j/job/rdf4j-develop-deploy/91/display/redirect>

Changes:


------------------------------------------
[...truncated 1.80 MB...]
2020-05-22 23:25:27 [EmbeddedElsHandler] INFO  p.a.t.e.ElasticServer - [2020-05-22T23:25:27,122][INFO ][o.e.p.PluginsService     ] [MvXzJIZ] loaded module [lang-painless]
2020-05-22 23:25:27 [EmbeddedElsHandler] INFO  p.a.t.e.ElasticServer - [2020-05-22T23:25:27,122][INFO ][o.e.p.PluginsService     ] [MvXzJIZ] loaded module [mapper-extras]
2020-05-22 23:25:27 [EmbeddedElsHandler] INFO  p.a.t.e.ElasticServer - [2020-05-22T23:25:27,122][INFO ][o.e.p.PluginsService     ] [MvXzJIZ] loaded module [parent-join]
2020-05-22 23:25:27 [EmbeddedElsHandler] INFO  p.a.t.e.ElasticServer - [2020-05-22T23:25:27,122][INFO ][o.e.p.PluginsService     ] [MvXzJIZ] loaded module [percolator]
2020-05-22 23:25:27 [EmbeddedElsHandler] INFO  p.a.t.e.ElasticServer - [2020-05-22T23:25:27,122][INFO ][o.e.p.PluginsService     ] [MvXzJIZ] loaded module [rank-eval]
2020-05-22 23:25:27 [EmbeddedElsHandler] INFO  p.a.t.e.ElasticServer - [2020-05-22T23:25:27,122][INFO ][o.e.p.PluginsService     ] [MvXzJIZ] loaded module [reindex]
2020-05-22 23:25:27 [EmbeddedElsHandler] INFO  p.a.t.e.ElasticServer - [2020-05-22T23:25:27,122][INFO ][o.e.p.PluginsService     ] [MvXzJIZ] loaded module [repository-url]
2020-05-22 23:25:27 [EmbeddedElsHandler] INFO  p.a.t.e.ElasticServer - [2020-05-22T23:25:27,122][INFO ][o.e.p.PluginsService     ] [MvXzJIZ] loaded module [transport-netty4]
2020-05-22 23:25:27 [EmbeddedElsHandler] INFO  p.a.t.e.ElasticServer - [2020-05-22T23:25:27,122][INFO ][o.e.p.PluginsService     ] [MvXzJIZ] loaded module [tribe]
2020-05-22 23:25:27 [EmbeddedElsHandler] INFO  p.a.t.e.ElasticServer - [2020-05-22T23:25:27,123][INFO ][o.e.p.PluginsService     ] [MvXzJIZ] loaded module [x-pack-ccr]
2020-05-22 23:25:27 [EmbeddedElsHandler] INFO  p.a.t.e.ElasticServer - [2020-05-22T23:25:27,123][INFO ][o.e.p.PluginsService     ] [MvXzJIZ] loaded module [x-pack-core]
2020-05-22 23:25:27 [EmbeddedElsHandler] INFO  p.a.t.e.ElasticServer - [2020-05-22T23:25:27,123][INFO ][o.e.p.PluginsService     ] [MvXzJIZ] loaded module [x-pack-deprecation]
2020-05-22 23:25:27 [EmbeddedElsHandler] INFO  p.a.t.e.ElasticServer - [2020-05-22T23:25:27,123][INFO ][o.e.p.PluginsService     ] [MvXzJIZ] loaded module [x-pack-graph]
2020-05-22 23:25:27 [EmbeddedElsHandler] INFO  p.a.t.e.ElasticServer - [2020-05-22T23:25:27,123][INFO ][o.e.p.PluginsService     ] [MvXzJIZ] loaded module [x-pack-ilm]
2020-05-22 23:25:27 [EmbeddedElsHandler] INFO  p.a.t.e.ElasticServer - [2020-05-22T23:25:27,123][INFO ][o.e.p.PluginsService     ] [MvXzJIZ] loaded module [x-pack-logstash]
2020-05-22 23:25:27 [EmbeddedElsHandler] INFO  p.a.t.e.ElasticServer - [2020-05-22T23:25:27,123][INFO ][o.e.p.PluginsService     ] [MvXzJIZ] loaded module [x-pack-ml]
2020-05-22 23:25:27 [EmbeddedElsHandler] INFO  p.a.t.e.ElasticServer - [2020-05-22T23:25:27,123][INFO ][o.e.p.PluginsService     ] [MvXzJIZ] loaded module [x-pack-monitoring]
2020-05-22 23:25:27 [EmbeddedElsHandler] INFO  p.a.t.e.ElasticServer - [2020-05-22T23:25:27,123][INFO ][o.e.p.PluginsService     ] [MvXzJIZ] loaded module [x-pack-rollup]
2020-05-22 23:25:27 [EmbeddedElsHandler] INFO  p.a.t.e.ElasticServer - [2020-05-22T23:25:27,123][INFO ][o.e.p.PluginsService     ] [MvXzJIZ] loaded module [x-pack-security]
2020-05-22 23:25:27 [EmbeddedElsHandler] INFO  p.a.t.e.ElasticServer - [2020-05-22T23:25:27,123][INFO ][o.e.p.PluginsService     ] [MvXzJIZ] loaded module [x-pack-sql]
2020-05-22 23:25:27 [EmbeddedElsHandler] INFO  p.a.t.e.ElasticServer - [2020-05-22T23:25:27,123][INFO ][o.e.p.PluginsService     ] [MvXzJIZ] loaded module [x-pack-upgrade]
2020-05-22 23:25:27 [EmbeddedElsHandler] INFO  p.a.t.e.ElasticServer - [2020-05-22T23:25:27,123][INFO ][o.e.p.PluginsService     ] [MvXzJIZ] loaded module [x-pack-watcher]
2020-05-22 23:25:27 [EmbeddedElsHandler] INFO  p.a.t.e.ElasticServer - [2020-05-22T23:25:27,124][INFO ][o.e.p.PluginsService     ] [MvXzJIZ] no plugins loaded
2020-05-22 23:25:31 [EmbeddedElsHandler] INFO  p.a.t.e.ElasticServer - [2020-05-22T23:25:31,009][INFO ][o.e.x.s.a.s.FileRolesStore] [MvXzJIZ] parsed [0] roles from file [/tmp/26043605-0dea-4865-a4f6-65c2f8b772a3/elasticsearch-6.8.8/config/roles.yml]
2020-05-22 23:25:31 [EmbeddedElsHandler] INFO  p.a.t.e.ElasticServer - [2020-05-22T23:25:31,762][INFO ][o.e.x.m.p.l.CppLogMessageHandler] [MvXzJIZ] [controller/37652] [Main.cc@109] controller (64 bit): Version 6.8.8 (Build 398321ce7838fd) Copyright (c) 2020 Elasticsearch BV
2020-05-22 23:25:32 [EmbeddedElsHandler] INFO  p.a.t.e.ElasticServer - [2020-05-22T23:25:32,370][DEBUG][o.e.a.ActionModule       ] [MvXzJIZ] Using REST wrapper from plugin org.elasticsearch.xpack.security.Security
2020-05-22 23:25:37 [EmbeddedElsHandler] INFO  p.a.t.e.ElasticServer - [2020-05-22T23:25:37,753][INFO ][o.e.d.DiscoveryModule    ] [MvXzJIZ] using discovery type [zen] and host providers [settings]
2020-05-22 23:25:38 [EmbeddedElsHandler] INFO  p.a.t.e.ElasticServer - [2020-05-22T23:25:38,474][INFO ][o.e.n.Node               ] [MvXzJIZ] initialized
2020-05-22 23:25:38 [EmbeddedElsHandler] INFO  p.a.t.e.ElasticServer - [2020-05-22T23:25:38,474][INFO ][o.e.n.Node               ] [MvXzJIZ] starting ...
2020-05-22 23:25:38 [EmbeddedElsHandler] INFO  p.a.t.e.ElasticServer - [2020-05-22T23:25:38,678][INFO ][o.e.t.TransportService   ] [MvXzJIZ] publish_address {127.0.0.1:10067}, bound_addresses {[::1]:10067}, {127.0.0.1:10067}
2020-05-22 23:25:38 [EmbeddedElsHandler] INFO  p.a.t.e.ElasticServer - Detected Elasticsearch transport tcp port : 10067
2020-05-22 23:25:38 [EmbeddedElsHandler] INFO  p.a.t.e.ElasticServer - [2020-05-22T23:25:38,696][WARN ][o.e.b.BootstrapChecks    ] [MvXzJIZ] max virtual memory areas vm.max_map_count [65530] is too low, increase to at least [262144]
2020-05-22 23:25:41 [EmbeddedElsHandler] INFO  p.a.t.e.ElasticServer - [2020-05-22T23:25:41,744][INFO ][o.e.c.s.MasterService    ] [MvXzJIZ] zen-disco-elected-as-master ([0] nodes joined), reason: new_master {MvXzJIZ}{MvXzJIZQQ0WKELK7shPA-Q}{5fYba7H-SwCd3AjTxyimrQ}{127.0.0.1}{127.0.0.1:10067}{ml.machine_memory=269920055296, xpack.installed=true, ml.max_open_jobs=20, ml.enabled=true}
2020-05-22 23:25:41 [EmbeddedElsHandler] INFO  p.a.t.e.ElasticServer - [2020-05-22T23:25:41,749][INFO ][o.e.c.s.ClusterApplierService] [MvXzJIZ] new_master {MvXzJIZ}{MvXzJIZQQ0WKELK7shPA-Q}{5fYba7H-SwCd3AjTxyimrQ}{127.0.0.1}{127.0.0.1:10067}{ml.machine_memory=269920055296, xpack.installed=true, ml.max_open_jobs=20, ml.enabled=true}, reason: apply cluster state (from master [master {MvXzJIZ}{MvXzJIZQQ0WKELK7shPA-Q}{5fYba7H-SwCd3AjTxyimrQ}{127.0.0.1}{127.0.0.1:10067}{ml.machine_memory=269920055296, xpack.installed=true, ml.max_open_jobs=20, ml.enabled=true} committed version [1] source [zen-disco-elected-as-master ([0] nodes joined)]])
2020-05-22 23:25:41 [EmbeddedElsHandler] INFO  p.a.t.e.ElasticServer - [2020-05-22T23:25:41,789][INFO ][o.e.h.n.Netty4HttpServerTransport] [MvXzJIZ] publish_address {127.0.0.1:12310}, bound_addresses {[::1]:12310}, {127.0.0.1:12310}
2020-05-22 23:25:41 [EmbeddedElsHandler] INFO  p.a.t.e.ElasticServer - Detected Elasticsearch http port : 12310
2020-05-22 23:25:41 [EmbeddedElsHandler] INFO  p.a.t.e.ElasticServer - [2020-05-22T23:25:41,790][INFO ][o.e.n.Node               ] [MvXzJIZ] started
2020-05-22 23:25:41 [main] INFO  p.a.t.e.ElasticServer - ElasticSearch started...
2020-05-22 23:25:42 [EmbeddedElsHandler] INFO  p.a.t.e.ElasticServer - [2020-05-22T23:25:42,276][WARN ][o.e.x.s.a.s.m.NativeRoleMappingStore] [MvXzJIZ] Failed to clear cache for realms [[]]
2020-05-22 23:25:42 [EmbeddedElsHandler] INFO  p.a.t.e.ElasticServer - [2020-05-22T23:25:42,318][INFO ][o.e.g.GatewayService     ] [MvXzJIZ] recovered [0] indices into cluster_state
2020-05-22 23:25:42 [main] INFO  o.e.r.s.e.TestHelpers - Elasticearch using transport port: 10067
2020-05-22 23:25:42 [main] INFO  o.e.r.s.e.TestHelpers - Elasticearch using http port: 12310
2020-05-22 23:25:42 [Time-limited test] INFO  o.e.r.s.e.ElasticsearchStore - Waiting for Elasticsearch to start
2020-05-22 23:25:42 [Time-limited test] INFO  o.e.r.s.e.ElasticsearchStore - Cluster status: GREEN
2020-05-22 23:25:42 [Time-limited test] INFO  o.e.r.s.e.ElasticsearchStore - Elasticsearch started!
2020-05-22 23:25:42 [EmbeddedElsHandler] INFO  p.a.t.e.ElasticServer - [2020-05-22T23:25:42,695][INFO ][o.e.c.m.MetaDataIndexTemplateService] [MvXzJIZ] adding template [.watch-history-9] for index patterns [.watcher-history-9*]
2020-05-22 23:25:43 [EmbeddedElsHandler] INFO  p.a.t.e.ElasticServer - [2020-05-22T23:25:43,527][INFO ][o.e.c.m.MetaDataIndexTemplateService] [MvXzJIZ] adding template [.triggered_watches] for index patterns [.triggered_watches*]
2020-05-22 23:25:44 [EmbeddedElsHandler] INFO  p.a.t.e.ElasticServer - [2020-05-22T23:25:44,052][INFO ][o.e.c.m.MetaDataIndexTemplateService] [MvXzJIZ] adding template [.watches] for index patterns [.watches*]
2020-05-22 23:25:44 [EmbeddedElsHandler] INFO  p.a.t.e.ElasticServer - [2020-05-22T23:25:44,586][INFO ][o.e.c.m.MetaDataIndexTemplateService] [MvXzJIZ] adding template [.monitoring-logstash] for index patterns [.monitoring-logstash-6-*]
2020-05-22 23:25:45 [EmbeddedElsHandler] INFO  p.a.t.e.ElasticServer - [2020-05-22T23:25:45,303][INFO ][o.e.c.m.MetaDataIndexTemplateService] [MvXzJIZ] adding template [.monitoring-es] for index patterns [.monitoring-es-6-*]
2020-05-22 23:25:45 [EmbeddedElsHandler] INFO  p.a.t.e.ElasticServer - [2020-05-22T23:25:45,784][INFO ][o.e.c.m.MetaDataIndexTemplateService] [MvXzJIZ] adding template [.monitoring-beats] for index patterns [.monitoring-beats-6-*]
2020-05-22 23:25:46 [EmbeddedElsHandler] INFO  p.a.t.e.ElasticServer - [2020-05-22T23:25:46,467][INFO ][o.e.c.m.MetaDataIndexTemplateService] [MvXzJIZ] adding template [.monitoring-alerts] for index patterns [.monitoring-alerts-6]
2020-05-22 23:25:47 [EmbeddedElsHandler] INFO  p.a.t.e.ElasticServer - [2020-05-22T23:25:47,238][INFO ][o.e.c.m.MetaDataIndexTemplateService] [MvXzJIZ] adding template [.monitoring-kibana] for index patterns [.monitoring-kibana-6-*]
2020-05-22 23:25:50 [EmbeddedElsHandler] INFO  p.a.t.e.ElasticServer - [2020-05-22T23:25:50,082][INFO ][o.e.c.m.MetaDataCreateIndexService] [MvXzJIZ] [index1] creating index, cause [api], templates [], shards [5]/[1], mappings [statement]
2020-05-22 23:25:58 [EmbeddedElsHandler] INFO  p.a.t.e.ElasticServer - [2020-05-22T23:25:58,004][INFO ][o.e.l.LicenseService     ] [MvXzJIZ] license [0a09ff70-5519-48b9-9b6a-24a774993736] mode [basic] - valid
2020-05-22 23:26:12 [EmbeddedElsHandler] INFO  p.a.t.e.ElasticServer - [2020-05-22T23:26:12,756][ERROR][o.e.x.m.e.l.LocalExporter] [MvXzJIZ] failed to set monitoring pipeline [xpack_monitoring_2]
2020-05-22 23:26:12 [EmbeddedElsHandler] INFO  p.a.t.e.ElasticServer - org.elasticsearch.cluster.metadata.ProcessClusterEventTimeoutException: failed to process cluster event (put-pipeline-xpack_monitoring_2) within 30s
2020-05-22 23:26:12 [EmbeddedElsHandler] INFO  p.a.t.e.ElasticServer - 	at org.elasticsearch.cluster.service.MasterService$Batcher.lambda$onTimeout$0(MasterService.java:127) ~[elasticsearch-6.8.8.jar:6.8.8]
2020-05-22 23:26:12 [EmbeddedElsHandler] INFO  p.a.t.e.ElasticServer - 	at java.util.ArrayList.forEach(ArrayList.java:1257) ~[?:1.8.0_202]
2020-05-22 23:26:12 [EmbeddedElsHandler] INFO  p.a.t.e.ElasticServer - 	at org.elasticsearch.cluster.service.MasterService$Batcher.lambda$onTimeout$1(MasterService.java:126) ~[elasticsearch-6.8.8.jar:6.8.8]
2020-05-22 23:26:12 [EmbeddedElsHandler] INFO  p.a.t.e.ElasticServer - 	at org.elasticsearch.common.util.concurrent.ThreadContext$ContextPreservingRunnable.run(ThreadContext.java:681) [elasticsearch-6.8.8.jar:6.8.8]
2020-05-22 23:26:12 [EmbeddedElsHandler] INFO  p.a.t.e.ElasticServer - 	at java.util.concurrent.ThreadPoolExecutor.runWorker(ThreadPoolExecutor.java:1149) [?:1.8.0_202]
2020-05-22 23:26:12 [EmbeddedElsHandler] INFO  p.a.t.e.ElasticServer - 	at java.util.concurrent.ThreadPoolExecutor$Worker.run(ThreadPoolExecutor.java:624) [?:1.8.0_202]
2020-05-22 23:26:12 [EmbeddedElsHandler] INFO  p.a.t.e.ElasticServer - 	at java.lang.Thread.run(Thread.java:748) [?:1.8.0_202]
2020-05-22 23:26:34 [EmbeddedElsHandler] INFO  p.a.t.e.ElasticServer - [2020-05-22T23:26:34,283][INFO ][o.e.c.m.MetaDataCreateIndexService] [MvXzJIZ] [index1_namespaces] creating index, cause [api], templates [], shards [5]/[1], mappings [namespace]
2020-05-22 23:26:42 [Time-limited test] INFO  o.e.r.s.e.ElasticsearchStore - Waiting for Elasticsearch to start
2020-05-22 23:26:42 [Time-limited test] INFO  o.e.r.s.e.ElasticsearchStore - Cluster status: YELLOW
2020-05-22 23:26:42 [Time-limited test] INFO  o.e.r.s.e.ElasticsearchStore - Elasticsearch started!
2020-05-22 23:26:44 [Time-limited test] INFO  o.e.r.s.e.ElasticsearchStore - Waiting for Elasticsearch to start
2020-05-22 23:26:44 [Time-limited test] INFO  o.e.r.s.e.ElasticsearchStore - Cluster status: YELLOW
2020-05-22 23:26:44 [Time-limited test] INFO  o.e.r.s.e.ElasticsearchStore - Elasticsearch started!
2020-05-22 23:26:46 [Time-limited test] INFO  o.e.r.s.e.ElasticsearchStore - Waiting for Elasticsearch to start
2020-05-22 23:26:46 [Time-limited test] INFO  o.e.r.s.e.ElasticsearchStore - Cluster status: YELLOW
2020-05-22 23:26:46 [Time-limited test] INFO  o.e.r.s.e.ElasticsearchStore - Elasticsearch started!
2020-05-22 23:26:49 [Time-limited test] INFO  o.e.r.s.e.ElasticsearchStore - Waiting for Elasticsearch to start
2020-05-22 23:26:49 [Time-limited test] INFO  o.e.r.s.e.ElasticsearchStore - Cluster status: YELLOW
2020-05-22 23:26:49 [Time-limited test] INFO  o.e.r.s.e.ElasticsearchStore - Elasticsearch started!
Build timed out (after 240 minutes). Marking the build as failed.
[INFO] 
[INFO] Results:
[INFO] 
[ERROR] Errors: 
[ERROR]   ElasticsearchStoreConnectionTest.testAddZipFile[READ_UNCOMMITTED] ยป NoShardAvailableAction
[INFO] 
[ERROR] Tests run: 290, Failures: 0, Errors: 1, Skipped: 2
[INFO] 
[ERROR] There are test failures.

Please refer to <https://ci.eclipse.org/rdf4j/job/rdf4j-develop-deploy/ws/core/sail/elasticsearch-store/target/surefire-reports> for the individual test results.
Please refer to dump files (if any exist) [date].dump, [date]-jvmRun[N].dump and [date].dumpstream.
The forked VM terminated without properly saying goodbye. VM crash or System.exit called?
Command was /bin/sh -c cd <https://ci.eclipse.org/rdf4j/job/rdf4j-develop-deploy/ws/core/sail/elasticsearch-store> && /opt/tools/java/oracle/jdk-8/1.8.0_202/jre/bin/java -Xmx1024M -jar <https://ci.eclipse.org/rdf4j/job/rdf4j-develop-deploy/ws/core/sail/elasticsearch-store/target/surefire/surefirebooter1375110303844756894.jar> <https://ci.eclipse.org/rdf4j/job/rdf4j-develop-deploy/ws/core/sail/elasticsearch-store/target/surefire> 2020-05-22T19-29-42_838-jvmRun1 surefire4120839004551430970tmp surefire_481223555415302042434tmp

Error while executing forked tests.Error while executing external command, process killed.org.apache.maven.surefire.shade.org.apache.maven.shared.utils.cli.CommandLineTimeOutException: Error while executing external command, process killed.
	at org.apache.maven.surefire.shade.org.apache.maven.shared.utils.cli.CommandLineUtils$1.call(CommandLineUtils.java:308)
	at org.apache.maven.plugin.surefire.booterclient.ForkStarter.fork(ForkStarter.java:614)
	at org.apache.maven.plugin.surefire.booterclient.ForkStarter.run(ForkStarter.java:282)
	at org.apache.maven.plugin.surefire.booterclient.ForkStarter.run(ForkStarter.java:245)
	at org.apache.maven.plugin.surefire.AbstractSurefireMojo.executeProvider(AbstractSurefireMojo.java:1183)
	at org.apache.maven.plugin.surefire.AbstractSurefireMojo.executeAfterPreconditionsChecked(AbstractSurefireMojo.java:1011)
	at org.apache.maven.plugin.surefire.AbstractSurefireMojo.execute(AbstractSurefireMojo.java:857)
	at org.apache.maven.plugin.DefaultBuildPluginManager.executeMojo(DefaultBuildPluginManager.java:137)
	at org.apache.maven.lifecycle.internal.MojoExecutor.execute(MojoExecutor.java:210)
	at org.apache.maven.lifecycle.internal.MojoExecutor.execute(MojoExecutor.java:156)
	at org.apache.maven.lifecycle.internal.MojoExecutor.execute(MojoExecutor.java:148)
	at org.apache.maven.lifecycle.internal.LifecycleModuleBuilder.buildProject(LifecycleModuleBuilder.java:117)
	at org.apache.maven.lifecycle.internal.LifecycleModuleBuilder.buildProject(LifecycleModuleBuilder.java:81)
	at org.apache.maven.lifecycle.internal.builder.singlethreaded.SingleThreadedBuilder.build(SingleThreadedBuilder.java:56)
	at org.apache.maven.lifecycle.internal.LifecycleStarter.execute(LifecycleStarter.java:128)
	at org.apache.maven.DefaultMaven.doExecute(DefaultMaven.java:305)
	at org.apache.maven.DefaultMaven.doExecute(DefaultMaven.java:192)
	at org.apache.maven.DefaultMaven.execute(DefaultMaven.java:105)
	at org.jvnet.hudson.maven3.launcher.Maven35Launcher.main(Maven35Launcher.java:130)
	at sun.reflect.NativeMethodAccessorImpl.invoke0(Native Method)
	at sun.reflect.NativeMethodAccessorImpl.invoke(NativeMethodAccessorImpl.java:62)
	at sun.reflect.DelegatingMethodAccessorImpl.invoke(DelegatingMethodAccessorImpl.java:43)
	at java.lang.reflect.Method.invoke(Method.java:498)
	at org.codehaus.plexus.classworlds.launcher.Launcher.launchEnhanced(Launcher.java:282)
	at org.codehaus.plexus.classworlds.launcher.Launcher.launch(Launcher.java:225)
	at jenkins.maven3.agent.Maven35Main.launch(Maven35Main.java:178)
	at sun.reflect.NativeMethodAccessorImpl.invoke0(Native Method)
	at sun.reflect.NativeMethodAccessorImpl.invoke(NativeMethodAccessorImpl.java:62)
	at sun.reflect.DelegatingMethodAccessorImpl.invoke(DelegatingMethodAccessorImpl.java:43)
	at java.lang.reflect.Method.invoke(Method.java:498)
	at hudson.maven.Maven3Builder.call(Maven3Builder.java:139)
	at hudson.maven.Maven3Builder.call(Maven3Builder.java:70)
	at hudson.remoting.UserRequest.perform(UserRequest.java:211)
	at hudson.remoting.UserRequest.perform(UserRequest.java:54)
	at hudson.remoting.Request$2.run(Request.java:369)
	at hudson.remoting.InterceptingExecutorService$1.call(InterceptingExecutorService.java:72)
	at java.util.concurrent.FutureTask.run(FutureTask.java:266)
	at java.util.concurrent.ThreadPoolExecutor.runWorker(ThreadPoolExecutor.java:1149)
	at java.util.concurrent.ThreadPoolExecutor$Worker.run(ThreadPoolExecutor.java:624)
	at java.lang.Thread.run(Thread.java:748)
Caused by: java.lang.InterruptedException
	at java.lang.Object.wait(Native Method)
	at java.lang.Object.wait(Object.java:502)
	at java.lang.UNIXProcess.waitFor(UNIXProcess.java:395)
	at org.apache.maven.surefire.shade.org.apache.maven.shared.utils.cli.CommandLineUtils$1.call(CommandLineUtils.java:260)
	... 39 more
Fatal Tests run: 290, Failures: 0, Errors: 1, Skipped: 2, Flakes: 0, Elapsed timeout: false
Crashed tests:
org.eclipse.rdf4j.sail.elasticsearchstore.compliance.ElasticsearchStoreContextTest
org.apache.maven.surefire.booter.SurefireBooterForkException: The forked VM terminated without properly saying goodbye. VM crash or System.exit called?
Command was /bin/sh -c cd <https://ci.eclipse.org/rdf4j/job/rdf4j-develop-deploy/ws/core/sail/elasticsearch-store> && /opt/tools/java/oracle/jdk-8/1.8.0_202/jre/bin/java -Xmx1024M -jar <https://ci.eclipse.org/rdf4j/job/rdf4j-develop-deploy/ws/core/sail/elasticsearch-store/target/surefire/surefirebooter1375110303844756894.jar> <https://ci.eclipse.org/rdf4j/job/rdf4j-develop-deploy/ws/core/sail/elasticsearch-store/target/surefire> 2020-05-22T19-29-42_838-jvmRun1 surefire4120839004551430970tmp surefire_481223555415302042434tmp

Error while executing forked tests.Error while executing external command, process killed.org.apache.maven.surefire.shade.org.apache.maven.shared.utils.cli.CommandLineTimeOutException: Error while executing external command, process killed.
	at org.apache.maven.surefire.shade.org.apache.maven.shared.utils.cli.CommandLineUtils$1.call(CommandLineUtils.java:308)
	at org.apache.maven.plugin.surefire.booterclient.ForkStarter.fork(ForkStarter.java:614)
	at org.apache.maven.plugin.surefire.booterclient.ForkStarter.run(ForkStarter.java:282)
	at org.apache.maven.plugin.surefire.booterclient.ForkStarter.run(ForkStarter.java:245)
	at org.apache.maven.plugin.surefire.AbstractSurefireMojo.executeProvider(AbstractSurefireMojo.java:1183)
	at org.apache.maven.plugin.surefire.AbstractSurefireMojo.executeAfterPreconditionsChecked(AbstractSurefireMojo.java:1011)
	at org.apache.maven.plugin.surefire.AbstractSurefireMojo.execute(AbstractSurefireMojo.java:857)
	at org.apache.maven.plugin.DefaultBuildPluginManager.executeMojo(DefaultBuildPluginManager.java:137)
	at org.apache.maven.lifecycle.internal.MojoExecutor.execute(MojoExecutor.java:210)
	at org.apache.maven.lifecycle.internal.MojoExecutor.execute(MojoExecutor.java:156)
	at org.apache.maven.lifecycle.internal.MojoExecutor.execute(MojoExecutor.java:148)
	at org.apache.maven.lifecycle.internal.LifecycleModuleBuilder.buildProject(LifecycleModuleBuilder.java:117)
	at org.apache.maven.lifecycle.internal.LifecycleModuleBuilder.buildProject(LifecycleModuleBuilder.java:81)
	at org.apache.maven.lifecycle.internal.builder.singlethreaded.SingleThreadedBuilder.build(SingleThreadedBuilder.java:56)
	at org.apache.maven.lifecycle.internal.LifecycleStarter.execute(LifecycleStarter.java:128)
	at org.apache.maven.DefaultMaven.doExecute(DefaultMaven.java:305)
	at org.apache.maven.DefaultMaven.doExecute(DefaultMaven.java:192)
	at org.apache.maven.DefaultMaven.execute(DefaultMaven.java:105)
	at org.jvnet.hudson.maven3.launcher.Maven35Launcher.main(Maven35Launcher.java:130)
	at sun.reflect.NativeMethodAccessorImpl.invoke0(Native Method)
	at sun.reflect.NativeMethodAccessorImpl.invoke(NativeMethodAccessorImpl.java:62)
	at sun.reflect.DelegatingMethodAccessorImpl.invoke(DelegatingMethodAccessorImpl.java:43)
	at java.lang.reflect.Method.invoke(Method.java:498)
	at org.codehaus.plexus.classworlds.launcher.Launcher.launchEnhanced(Launcher.java:282)
	at org.codehaus.plexus.classworlds.launcher.Launcher.launch(Launcher.java:225)
	at jenkins.maven3.agent.Maven35Main.launch(Maven35Main.java:178)
	at sun.reflect.NativeMethodAccessorImpl.invoke0(Native Method)
	at sun.reflect.NativeMethodAccessorImpl.invoke(NativeMethodAccessorImpl.java:62)
	at sun.reflect.DelegatingMethodAccessorImpl.invoke(DelegatingMethodAccessorImpl.java:43)
	at java.lang.reflect.Method.invoke(Method.java:498)
	at hudson.maven.Maven3Builder.call(Maven3Builder.java:139)
	at hudson.maven.Maven3Builder.call(Maven3Builder.java:70)
	at hudson.remoting.UserRequest.perform(UserRequest.java:211)
	at hudson.remoting.UserRequest.perform(UserRequest.java:54)
	at hudson.remoting.Request$2.run(Request.java:369)
	at hudson.remoting.InterceptingExecutorService$1.call(InterceptingExecutorService.java:72)
	at java.util.concurrent.FutureTask.run(FutureTask.java:266)
	at java.util.concurrent.ThreadPoolExecutor.runWorker(ThreadPoolExecutor.java:1149)
	at java.util.concurrent.ThreadPoolExecutor$Worker.run(ThreadPoolExecutor.java:624)
	at java.lang.Thread.run(Thread.java:748)
Caused by: java.lang.InterruptedException
	at java.lang.Object.wait(Native Method)
	at java.lang.Object.wait(Object.java:502)
	at java.lang.UNIXProcess.waitFor(UNIXProcess.java:395)
	at org.apache.maven.surefire.shade.org.apache.maven.shared.utils.cli.CommandLineUtils$1.call(CommandLineUtils.java:260)
	... 39 more
Fatal Tests run: 290, Failures: 0, Errors: 1, Skipped: 2, Flakes: 0, Elapsed timeout: false
Crashed tests:
org.eclipse.rdf4j.sail.elasticsearchstore.compliance.ElasticsearchStoreContextTest
	at org.apache.maven.plugin.surefire.booterclient.ForkStarter.fork(ForkStarter.java:669)
	at org.apache.maven.plugin.surefire.booterclient.ForkStarter.run(ForkStarter.java:282)
	at org.apache.maven.plugin.surefire.booterclient.ForkStarter.run(ForkStarter.java:245)
	at org.apache.maven.plugin.surefire.AbstractSurefireMojo.executeProvider(AbstractSurefireMojo.java:1183)
	at org.apache.maven.plugin.surefire.AbstractSurefireMojo.executeAfterPreconditionsChecked(AbstractSurefireMojo.java:1011)
	at org.apache.maven.plugin.surefire.AbstractSurefireMojo.execute(AbstractSurefireMojo.java:857)
	at org.apache.maven.plugin.DefaultBuildPluginManager.executeMojo(DefaultBuildPluginManager.java:137)
	at org.apache.maven.lifecycle.internal.MojoExecutor.execute(MojoExecutor.java:210)
	at org.apache.maven.lifecycle.internal.MojoExecutor.execute(MojoExecutor.java:156)
	at org.apache.maven.lifecycle.internal.MojoExecutor.execute(MojoExecutor.java:148)
	at org.apache.maven.lifecycle.internal.LifecycleModuleBuilder.buildProject(LifecycleModuleBuilder.java:117)
	at org.apache.maven.lifecycle.internal.LifecycleModuleBuilder.buildProject(LifecycleModuleBuilder.java:81)
	at org.apache.maven.lifecycle.internal.builder.singlethreaded.SingleThreadedBuilder.build(SingleThreadedBuilder.java:56)
	at org.apache.maven.lifecycle.internal.LifecycleStarter.execute(LifecycleStarter.java:128)
	at org.apache.maven.DefaultMaven.doExecute(DefaultMaven.java:305)
	at org.apache.maven.DefaultMaven.doExecute(DefaultMaven.java:192)
	at org.apache.maven.DefaultMaven.execute(DefaultMaven.java:105)
	at org.jvnet.hudson.maven3.launcher.Maven35Launcher.main(Maven35Launcher.java:130)
	at sun.reflect.NativeMethodAccessorImpl.invoke0(Native Method)
	at sun.reflect.NativeMethodAccessorImpl.invoke(NativeMethodAccessorImpl.java:62)
	at sun.reflect.DelegatingMethodAccessorImpl.invoke(DelegatingMethodAccessorImpl.java:43)
	at java.lang.reflect.Method.invoke(Method.java:498)
	at org.codehaus.plexus.classworlds.launcher.Launcher.launchEnhanced(Launcher.java:282)
	at org.codehaus.plexus.classworlds.launcher.Launcher.launch(Launcher.java:225)
	at jenkins.maven3.agent.Maven35Main.launch(Maven35Main.java:178)
	at sun.reflect.NativeMethodAccessorImpl.invoke0(Native Method)
	at sun.reflect.NativeMethodAccessorImpl.invoke(NativeMethodAccessorImpl.java:62)
	at sun.reflect.DelegatingMethodAccessorImpl.invoke(DelegatingMethodAccessorImpl.java:43)
	at java.lang.reflect.Method.invoke(Method.java:498)
	at hudson.maven.Maven3Builder.call(Maven3Builder.java:139)
	at hudson.maven.Maven3Builder.call(Maven3Builder.java:70)
	at hudson.remoting.UserRequest.perform(UserRequest.java:211)
	at hudson.remoting.UserRequest.perform(UserRequest.java:54)
	at hudson.remoting.Request$2.run(Request.java:369)
	at hudson.remoting.InterceptingExecutorService$1.call(InterceptingExecutorService.java:72)
	at java.util.concurrent.FutureTask.run(FutureTask.java:266)
	at java.util.concurrent.ThreadPoolExecutor.runWorker(ThreadPoolExecutor.java:1149)
	at java.util.concurrent.ThreadPoolExecutor$Worker.run(ThreadPoolExecutor.java:624)
	at java.lang.Thread.run(Thread.java:748)
Caused by: java.lang.InterruptedException
	at java.lang.Object.wait(Native Method)
	at java.lang.Object.wait(Object.java:502)
	at java.lang.UNIXProcess.waitFor(UNIXProcess.java:395)
	at org.apache.maven.surefire.shade.org.apache.maven.shared.utils.cli.CommandLineUtils$1.call(CommandLineUtils.java:260)
	at org.apache.maven.plugin.surefire.booterclient.ForkStarter.fork(ForkStarter.java:614)
	... 38 more

[WARNING] Failed to notify spy hudson.maven.Maven3Builder$JenkinsEventSpy: java.util.concurrent.ExecutionException: Invalid object ID 77 iota=111
[INFO] 
[INFO] --- animal-sniffer-maven-plugin:1.16:check (default) @ rdf4j-sail-elasticsearch-store ---
[INFO] Checking unresolved references to org.codehaus.mojo.signature:java18:1.0
channel stopped
Build was aborted


Back to the top