Skip to main content

[Date Prev][Date Next][Thread Prev][Thread Next][Date Index][Thread Index] [List Home]
[jgit-build] Build failed in Jenkins: stable » jgit-stable #882

See <https://ci.eclipse.org/jgit/job/stable/job/jgit-stable/882/display/redirect>

------------------------------------------
[...truncated 357.64 KB...]
	at org.junit.runners.BlockJUnit4ClassRunner.runChild(BlockJUnit4ClassRunner.java:57)
	at org.junit.runners.ParentRunner$3.run(ParentRunner.java:290)
	at org.junit.runners.ParentRunner$1.schedule(ParentRunner.java:71)
	at org.junit.runners.ParentRunner.runChildren(ParentRunner.java:288)
	at org.junit.runners.ParentRunner.access$000(ParentRunner.java:58)
	at org.junit.runners.ParentRunner$2.evaluate(ParentRunner.java:268)
	at org.junit.runners.ParentRunner.run(ParentRunner.java:363)
	at org.apache.maven.surefire.junit4.JUnit4Provider.execute(JUnit4Provider.java:369)
	at org.apache.maven.surefire.junit4.JUnit4Provider.executeWithRerun(JUnit4Provider.java:275)
	at org.apache.maven.surefire.junit4.JUnit4Provider.executeTestSet(JUnit4Provider.java:239)
	at org.apache.maven.surefire.junit4.JUnit4Provider.invoke(JUnit4Provider.java:160)
	at org.apache.maven.surefire.booter.ForkedBooter.invokeProviderInSameClassLoader(ForkedBooter.java:373)
	at org.apache.maven.surefire.booter.ForkedBooter.runSuitesInProcess(ForkedBooter.java:334)
	at org.apache.maven.surefire.booter.ForkedBooter.execute(ForkedBooter.java:119)
	at org.apache.maven.surefire.booter.ForkedBooter.main(ForkedBooter.java:407)
[INFO] Tests run: 168, Failures: 0, Errors: 0, Skipped: 0, Time elapsed: 0.113 s - in org.eclipse.jgit.ignore.IgnoreRuleSpecialCasesTest
[INFO] Running org.eclipse.jgit.merge.SquashMessageFormatterTest
[INFO] Tests run: 3, Failures: 0, Errors: 0, Skipped: 0, Time elapsed: 18.225 s - in org.eclipse.jgit.submodule.SubmoduleSyncTest
[INFO] Running org.eclipse.jgit.merge.SimpleMergeTest
2019-03-12 23:06:03 INFO  WalkEncryptionTest:907 - Testing  Version: 0 Profile: PBEWITHHMACSHA384ANDAES_128 Present: true Allowed: true
[INFO] Tests run: 1, Failures: 0, Errors: 0, Skipped: 0, Time elapsed: 1.532 s - in org.eclipse.jgit.merge.SquashMessageFormatterTest
[INFO] Running org.eclipse.jgit.merge.MergeAlgorithmTest
[INFO] Tests run: 18, Failures: 0, Errors: 0, Skipped: 0, Time elapsed: 98.709 s - in org.eclipse.jgit.api.BlameCommandTest
[INFO] Running org.eclipse.jgit.merge.RecursiveMergerTest
2019-03-12 23:06:03 INFO  WalkEncryptionTest:907 - Testing  Version: 1 Profile: PBEWITHHMACSHA384ANDAES_128 Present: true Allowed: true
[INFO] Tests run: 20, Failures: 0, Errors: 0, Skipped: 0, Time elapsed: 0.08 s - in org.eclipse.jgit.merge.MergeAlgorithmTest
[INFO] Running org.eclipse.jgit.merge.CherryPickTest
2019-03-12 23:06:03 INFO  WalkEncryptionTest:907 - Testing  Version: 0 Profile: PBEWITHHMACSHA384ANDAES_256 Present: true Allowed: true
2019-03-12 23:06:06 INFO  WalkEncryptionTest:907 - Testing  Version: 1 Profile: PBEWITHHMACSHA384ANDAES_256 Present: true Allowed: true
2019-03-12 23:06:07 INFO  WalkEncryptionTest:907 - Testing  Version: 0 Profile: PBEWITHHMACSHA512ANDAES_128 Present: true Allowed: true
2019-03-12 23:06:10 INFO  WalkEncryptionTest:907 - Testing  Version: 1 Profile: PBEWITHHMACSHA512ANDAES_128 Present: true Allowed: true
[INFO] Tests run: 2, Failures: 0, Errors: 0, Skipped: 0, Time elapsed: 10.24 s - in org.eclipse.jgit.merge.CherryPickTest
[INFO] Running org.eclipse.jgit.merge.MergeMessageFormatterTest
2019-03-12 23:06:14 INFO  WalkEncryptionTest:907 - Testing  Version: 0 Profile: PBEWITHHMACSHA512ANDAES_256 Present: true Allowed: true
2019-03-12 23:06:14 ERROR FastIgnoreRule:133 - Collating symbols [[.a.]] or equivalence class expressions [[=a=]] are not supported
org.eclipse.jgit.errors.InvalidPatternException: Collating symbols [[.a.]] or equivalence class expressions [[=a=]] are not supported
	at org.eclipse.jgit.ignore.internal.Strings.convertGlob(Strings.java:283)
	at org.eclipse.jgit.ignore.internal.WildCardMatcher.<init>(WildCardMatcher.java:64)
	at org.eclipse.jgit.ignore.internal.PathMatcher.createNameMatcher0(PathMatcher.java:170)
	at org.eclipse.jgit.ignore.internal.PathMatcher.createPathMatcher(PathMatcher.java:129)
	at org.eclipse.jgit.ignore.FastIgnoreRule.<init>(FastIgnoreRule.java:129)
	at org.eclipse.jgit.ignore.IgnoreNode.parse(IgnoreNode.java:115)
	at org.eclipse.jgit.ignore.IgnoreNodeTest.testEmptyIgnoreRules(IgnoreNodeTest.java:333)
	at sun.reflect.NativeMethodAccessorImpl.invoke0(Native Method)
	at sun.reflect.NativeMethodAccessorImpl.invoke(NativeMethodAccessorImpl.java:62)
	at sun.reflect.DelegatingMethodAccessorImpl.invoke(DelegatingMethodAccessorImpl.java:43)
	at java.lang.reflect.Method.invoke(Method.java:498)
	at org.junit.runners.model.FrameworkMethod$1.runReflectiveCall(FrameworkMethod.java:50)
	at org.junit.internal.runners.model.ReflectiveCallable.run(ReflectiveCallable.java:12)
	at org.junit.runners.model.FrameworkMethod.invokeExplosively(FrameworkMethod.java:47)
	at org.junit.internal.runners.statements.InvokeMethod.evaluate(InvokeMethod.java:17)
	at org.junit.internal.runners.statements.RunBefores.evaluate(RunBefores.java:26)
	at org.junit.internal.runners.statements.RunAfters.evaluate(RunAfters.java:27)
	at org.junit.runners.ParentRunner.runLeaf(ParentRunner.java:325)
	at org.junit.runners.BlockJUnit4ClassRunner.runChild(BlockJUnit4ClassRunner.java:78)
	at org.junit.runners.BlockJUnit4ClassRunner.runChild(BlockJUnit4ClassRunner.java:57)
	at org.junit.runners.ParentRunner$3.run(ParentRunner.java:290)
	at org.junit.runners.ParentRunner$1.schedule(ParentRunner.java:71)
	at org.junit.runners.ParentRunner.runChildren(ParentRunner.java:288)
	at org.junit.runners.ParentRunner.access$000(ParentRunner.java:58)
	at org.junit.runners.ParentRunner$2.evaluate(ParentRunner.java:268)
	at org.junit.runners.ParentRunner.run(ParentRunner.java:363)
	at org.apache.maven.surefire.junit4.JUnit4Provider.execute(JUnit4Provider.java:369)
	at org.apache.maven.surefire.junit4.JUnit4Provider.executeWithRerun(JUnit4Provider.java:275)
	at org.apache.maven.surefire.junit4.JUnit4Provider.executeTestSet(JUnit4Provider.java:239)
	at org.apache.maven.surefire.junit4.JUnit4Provider.invoke(JUnit4Provider.java:160)
	at org.apache.maven.surefire.booter.ForkedBooter.invokeProviderInSameClassLoader(ForkedBooter.java:373)
	at org.apache.maven.surefire.booter.ForkedBooter.runSuitesInProcess(ForkedBooter.java:334)
	at org.apache.maven.surefire.booter.ForkedBooter.execute(ForkedBooter.java:119)
	at org.apache.maven.surefire.booter.ForkedBooter.main(ForkedBooter.java:407)
2019-03-12 23:06:15 INFO  WalkEncryptionTest:907 - Testing  Version: 1 Profile: PBEWITHHMACSHA512ANDAES_256 Present: true Allowed: true
2019-03-12 23:06:17 INFO  WalkEncryptionTest:907 - Testing  Version: 0 Profile: PBEWITHMD5ANDDES Present: true Allowed: true
[INFO] Tests run: 11, Failures: 0, Errors: 0, Skipped: 0, Time elapsed: 22.295 s - in org.eclipse.jgit.submodule.SubmoduleWalkTest
[INFO] Running org.eclipse.jgit.merge.ResolveMergerTest
2019-03-12 23:06:18 INFO  WalkEncryptionTest:907 - Testing  Version: 1 Profile: PBEWITHMD5ANDDES Present: true Allowed: true
2019-03-12 23:06:21 INFO  WalkEncryptionTest:907 - Testing  Version: 0 Profile: PBEWITHMD5ANDTRIPLEDES Present: true Allowed: true
2019-03-12 23:06:24 INFO  WalkEncryptionTest:907 - Testing  Version: 1 Profile: PBEWITHMD5ANDTRIPLEDES Present: true Allowed: true
[INFO] Tests run: 19, Failures: 0, Errors: 0, Skipped: 0, Time elapsed: 25.566 s - in org.eclipse.jgit.ignore.IgnoreNodeTest
[INFO] Running org.eclipse.jgit.gitrepo.RepoCommandSymlinkTest
2019-03-12 23:06:24 INFO  WalkEncryptionTest:907 - Testing  Version: 0 Profile: PBEWITHSHA1ANDDESEDE Present: true Allowed: true
[INFO] Tests run: 15, Failures: 0, Errors: 0, Skipped: 0, Time elapsed: 26.414 s - in org.eclipse.jgit.ignore.CGitIgnoreTest
[INFO] Running org.eclipse.jgit.gitrepo.RepoCommandTest
[INFO] Tests run: 10, Failures: 0, Errors: 0, Skipped: 0, Time elapsed: 36.195 s - in org.eclipse.jgit.submodule.SubmoduleAddTest
2019-03-12 23:06:25 INFO  WalkEncryptionTest:907 - Testing  Version: 1 Profile: PBEWITHSHA1ANDDESEDE Present: true Allowed: true
[INFO] Running org.eclipse.jgit.gitrepo.ManifestParserTest
[INFO] Tests run: 3, Failures: 0, Errors: 0, Skipped: 0, Time elapsed: 0.054 s - in org.eclipse.jgit.gitrepo.ManifestParserTest
[INFO] Running org.eclipse.jgit.symlinks.SymlinksTest
[INFO] Tests run: 7, Failures: 0, Errors: 0, Skipped: 0, Time elapsed: 309.412 s - in org.eclipse.jgit.lib.IndexDiffSubmoduleTest
[INFO] Running org.eclipse.jgit.revplot.AbstractPlotRendererTest
2019-03-12 23:06:27 INFO  WalkEncryptionTest:907 - Testing  Version: 0 Profile: PBEWITHSHA1ANDRC2_128 Present: true Allowed: true
[INFO] Tests run: 6, Failures: 0, Errors: 0, Skipped: 0, Time elapsed: 50.085 s - in org.eclipse.jgit.submodule.SubmoduleDeinitTest
[INFO] Running org.eclipse.jgit.revplot.PlotCommitListTest
2019-03-12 23:06:27 INFO  WalkEncryptionTest:907 - Testing  Version: 1 Profile: PBEWITHSHA1ANDRC2_128 Present: true Allowed: true
2019-03-12 23:06:27 INFO  WalkEncryptionTest:907 - Testing  Version: 0 Profile: PBEWITHSHA1ANDRC2_40 Present: true Allowed: true
2019-03-12 23:06:28 INFO  WalkEncryptionTest:907 - Testing  Version: 1 Profile: PBEWITHSHA1ANDRC2_40 Present: true Allowed: true
[INFO] Tests run: 1, Failures: 0, Errors: 0, Skipped: 0, Time elapsed: 1.514 s - in org.eclipse.jgit.revplot.AbstractPlotRendererTest
[INFO] Running org.eclipse.jgit.fnmatch.FileNameMatcherTest
[INFO] Tests run: 155, Failures: 0, Errors: 0, Skipped: 0, Time elapsed: 0.122 s - in org.eclipse.jgit.fnmatch.FileNameMatcherTest
[INFO] Running org.eclipse.jgit.junit.TestRepositoryTest
2019-03-12 23:06:29 INFO  WalkEncryptionTest:907 - Testing  Version: 0 Profile: PBEWITHSHA1ANDRC4_128 Present: true Allowed: true
[INFO] Tests run: 14, Failures: 0, Errors: 0, Skipped: 0, Time elapsed: 0.164 s - in org.eclipse.jgit.junit.TestRepositoryTest
[INFO] Running org.eclipse.jgit.storage.file.FileBasedConfigTest
2019-03-12 23:06:30 INFO  WalkEncryptionTest:907 - Testing  Version: 1 Profile: PBEWITHSHA1ANDRC4_128 Present: true Allowed: true
[INFO] Tests run: 9, Failures: 0, Errors: 0, Skipped: 0, Time elapsed: 3.195 s - in org.eclipse.jgit.storage.file.FileBasedConfigTest
[INFO] Running org.eclipse.jgit.events.ConfigChangeEventTest
unpack error Invalid submodule URL '-upayload.sh'
[INFO] Tests run: 1, Failures: 0, Errors: 0, Skipped: 0, Time elapsed: 0.953 s - in org.eclipse.jgit.events.ConfigChangeEventTest
2019-03-12 23:06:33 INFO  WalkEncryptionTest:907 - Testing  Version: 0 Profile: PBEWITHSHA1ANDRC4_40 Present: true Allowed: true
2019-03-12 23:06:33 WARN  Repository:957 - close() called when useCnt is already zero for Repository[/jobs/genie.jgit/stable/jobs/jgit-stable/workspace/org.eclipse.jgit.test/target/jgit_test_1108369062953416193_tmp/tmp_7380542392465432779.git]
2019-03-12 23:06:33 WARN  Repository:957 - close() called when useCnt is already zero for Repository[/jobs/genie.jgit/stable/jobs/jgit-stable/workspace/org.eclipse.jgit.test/target/jgit_test_1108369062953416193_tmp/tmp_3072278259289031190/.git]
2019-03-12 23:06:34 INFO  WalkEncryptionTest:907 - Testing  Version: 1 Profile: PBEWITHSHA1ANDRC4_40 Present: true Allowed: true
2019-03-12 23:06:34 INFO  WalkEncryptionTest:533 - Proxy not used.
2019-03-12 23:06:34 INFO  WalkEncryptionTest:592 - JCE security policy restricted=false
2019-03-12 23:06:34 INFO  WalkEncryptionTest:971 - Long running tests are enabled.
2019-03-12 23:06:34 INFO  WalkEncryptionTest:942 - Public address: 198.41.30.252
2019-03-12 23:06:34 ERROR WalkEncryptionTest:931 - Amazon S3 test configuration is missing, tests will not run.
2019-03-12 23:06:34 INFO  WalkEncryptionTest:963 - Loaded org.bouncycastle.jce.provider.BouncyCastleProvider
[INFO] Tests run: 1, Failures: 0, Errors: 0, Skipped: 0, Time elapsed: 13.171 s - in org.eclipse.jgit.gitrepo.RepoCommandSymlinkTest
2019-03-12 23:06:39 WARN  WalkEncryptionTest:909 - Missing  Version: 1 Profile: AES_128/CBC/NOPADDING Present: false Allowed: false
2019-03-12 23:06:39 WARN  WalkEncryptionTest:909 - Missing  Version: 1 Profile: AES_128/CFB/NOPADDING Present: false Allowed: false
[INFO] Tests run: 16, Failures: 0, Errors: 0, Skipped: 0, Time elapsed: 36.378 s - in org.eclipse.jgit.merge.SimpleMergeTest
2019-03-12 23:06:40 WARN  Repository:957 - close() called when useCnt is already zero for Repository[/jobs/genie.jgit/stable/jobs/jgit-stable/workspace/org.eclipse.jgit.test/target/jgit_test_6161717841332577448_tmp/tmp_7114950661854097010.git]
2019-03-12 23:06:40 WARN  WalkEncryptionTest:909 - Missing  Version: 1 Profile: AES_128/ECB/NOPADDING Present: false Allowed: false
2019-03-12 23:06:42 WARN  WalkEncryptionTest:909 - Missing  Version: 1 Profile: AES_128/GCM/NOPADDING Present: false Allowed: false
[INFO] Tests run: 15, Failures: 0, Errors: 0, Skipped: 0, Time elapsed: 28.878 s - in org.eclipse.jgit.merge.MergeMessageFormatterTest
[INFO] Tests run: 27, Failures: 0, Errors: 0, Skipped: 0, Time elapsed: 159.798 s - in org.eclipse.jgit.api.StashApplyCommandTest
2019-03-12 23:06:43 WARN  WalkEncryptionTest:909 - Missing  Version: 1 Profile: AES_128/OFB/NOPADDING Present: false Allowed: false
[INFO] Tests run: 18, Failures: 0, Errors: 0, Skipped: 0, Time elapsed: 70.119 s - in org.eclipse.jgit.notes.NoteMapTest
2019-03-12 23:06:45 WARN  WalkEncryptionTest:909 - Missing  Version: 1 Profile: AES_192/CBC/NOPADDING Present: false Allowed: false
2019-03-12 23:06:46 WARN  WalkEncryptionTest:909 - Missing  Version: 1 Profile: AES_192/CFB/NOPADDING Present: false Allowed: false
2019-03-12 23:06:46 WARN  WalkEncryptionTest:909 - Missing  Version: 1 Profile: AES_192/ECB/NOPADDING Present: false Allowed: false
2019-03-12 23:06:46 WARN  WalkEncryptionTest:909 - Missing  Version: 1 Profile: AES_192/GCM/NOPADDING Present: false Allowed: false
[INFO] Tests run: 13, Failures: 0, Errors: 0, Skipped: 0, Time elapsed: 176.963 s - in org.eclipse.jgit.api.FetchCommandTest
2019-03-12 23:06:46 WARN  WalkEncryptionTest:909 - Missing  Version: 1 Profile: AES_192/OFB/NOPADDING Present: false Allowed: false
2019-03-12 23:06:47 WARN  WalkEncryptionTest:909 - Missing  Version: 1 Profile: AES_256/CBC/NOPADDING Present: false Allowed: false
2019-03-12 23:06:47 WARN  WalkEncryptionTest:909 - Missing  Version: 1 Profile: AES_256/CFB/NOPADDING Present: false Allowed: false
2019-03-12 23:06:47 WARN  WalkEncryptionTest:909 - Missing  Version: 1 Profile: AES_256/ECB/NOPADDING Present: false Allowed: false
2019-03-12 23:06:47 WARN  WalkEncryptionTest:909 - Missing  Version: 1 Profile: AES_256/GCM/NOPADDING Present: false Allowed: false
2019-03-12 23:06:47 WARN  WalkEncryptionTest:909 - Missing  Version: 1 Profile: AES_256/OFB/NOPADDING Present: false Allowed: false
[WARNING] Tests run: 55, Failures: 0, Errors: 0, Skipped: 55, Time elapsed: 86.57 s - in org.eclipse.jgit.transport.WalkEncryptionTest
[INFO] Tests run: 15, Failures: 0, Errors: 0, Skipped: 0, Time elapsed: 19.997 s - in org.eclipse.jgit.revplot.PlotCommitListTest
[INFO] Tests run: 9, Failures: 0, Errors: 0, Skipped: 0, Time elapsed: 20.882 s - in org.eclipse.jgit.symlinks.SymlinksTest
[INFO] Tests run: 43, Failures: 0, Errors: 0, Skipped: 0, Time elapsed: 264.798 s - in org.eclipse.jgit.api.MergeCommandTest
2019-03-12 23:06:58 WARN  Repository:957 - close() called when useCnt is already zero for Repository[/jobs/genie.jgit/stable/jobs/jgit-stable/workspace/org.eclipse.jgit.test/target/jgit_test_6257099742542042169_tmp/tmp_4566151957302331417.git]
[INFO] Tests run: 19, Failures: 0, Errors: 0, Skipped: 0, Time elapsed: 275.629 s - in org.eclipse.jgit.api.CloneCommandTest
[INFO] Tests run: 9, Failures: 0, Errors: 0, Skipped: 0, Time elapsed: 128.079 s - in org.eclipse.jgit.transport.ReceivePackAdvertiseRefsHookTest
[INFO] Tests run: 96, Failures: 0, Errors: 0, Skipped: 0, Time elapsed: 301.897 s - in org.eclipse.jgit.api.CommitOnlyTest
[INFO] Tests run: 70, Failures: 0, Errors: 0, Skipped: 0, Time elapsed: 322.267 s - in org.eclipse.jgit.api.RebaseCommandTest
[INFO] Tests run: 60, Failures: 0, Errors: 0, Skipped: 0, Time elapsed: 510.61 s - in org.eclipse.jgit.http.test.SmartClientSmartServerTest
[WARNING] Tests run: 32, Failures: 0, Errors: 0, Skipped: 1, Time elapsed: 227.856 s - in org.eclipse.jgit.api.CheckoutCommandTest
[INFO] Tests run: 17, Failures: 0, Errors: 0, Skipped: 0, Time elapsed: 129.383 s - in org.eclipse.jgit.notes.NoteMapMergerTest
[INFO] 
[INFO] Results:
[INFO] 
[INFO] Tests run: 133, Failures: 0, Errors: 0, Skipped: 0
[INFO] 
[INFO] 
[INFO] --- maven-jar-plugin:3.0.2:jar (default-jar) @ org.eclipse.jgit.http.test ---
[INFO] Building jar: /jobs/genie.jgit/stable/jobs/jgit-stable/workspace/org.eclipse.jgit.http.test/target/org.eclipse.jgit.http.test-4.10.1-SNAPSHOT.jar
[INFO] 
[INFO] --- maven-javadoc-plugin:3.0.0:jar (attach-javadocs) @ org.eclipse.jgit.http.test ---
[INFO] Skipping javadoc generation
[INFO] 
[INFO] --- maven-jar-plugin:3.0.2:test-jar (default) @ org.eclipse.jgit.http.test ---
[INFO] Building jar: /jobs/genie.jgit/stable/jobs/jgit-stable/workspace/org.eclipse.jgit.http.test/target/org.eclipse.jgit.http.test-4.10.1-SNAPSHOT-tests.jar
[INFO] 
[INFO] >>> spotbugs-maven-plugin:3.1.0:check (default) > :spotbugs @ org.eclipse.jgit.http.test >>>
[INFO] 
[INFO] --- spotbugs-maven-plugin:3.1.0:spotbugs (spotbugs) @ org.eclipse.jgit.http.test ---
[INFO] Fork Value is true
     [java] Picked up JAVA_TOOL_OPTIONS: -Xmx2G -Djava.io.tmpdir=/tmp/genie.jgit
[INFO] Done SpotBugs Analysis....
[INFO] 
[INFO] <<< spotbugs-maven-plugin:3.1.0:check (default) < :spotbugs @ org.eclipse.jgit.http.test <<<
[INFO] 
[INFO] 
[INFO] --- spotbugs-maven-plugin:3.1.0:check (default) @ org.eclipse.jgit.http.test ---
[INFO] BugInstance size is 0
[INFO] Error size is 0
[INFO] No errors/warnings found
[INFO] 
[INFO] >>> maven-pmd-plugin:3.8:cpd-check (default) > :cpd @ org.eclipse.jgit.http.test >>>
[INFO] 
[INFO] --- maven-pmd-plugin:3.8:cpd (cpd) @ org.eclipse.jgit.http.test ---
[INFO] 
[INFO] <<< maven-pmd-plugin:3.8:cpd-check (default) < :cpd @ org.eclipse.jgit.http.test <<<
[INFO] 
[INFO] 
[INFO] --- maven-pmd-plugin:3.8:cpd-check (default) @ org.eclipse.jgit.http.test ---
[INFO] 
[INFO] Tests run: 17, Failures: 0, Errors: 0, Skipped: 0, Time elapsed: 341.668 s - in org.eclipse.jgit.api.PullCommandTest
[INFO] Tests run: 23, Failures: 0, Errors: 0, Skipped: 0, Time elapsed: 126.489 s - in org.eclipse.jgit.merge.ResolveMergerTest
[INFO] Tests run: 8, Failures: 0, Errors: 0, Skipped: 0, Time elapsed: 177.698 s - in org.eclipse.jgit.merge.RecursiveMergerTest
[INFO] Tests run: 24, Failures: 0, Errors: 0, Skipped: 0, Time elapsed: 231.368 s - in org.eclipse.jgit.gitrepo.RepoCommandTest
[INFO] Tests run: 8, Failures: 0, Errors: 0, Skipped: 0, Time elapsed: 525.617 s - in org.eclipse.jgit.api.FetchAndPullCommandsRecurseSubmodulesTest
[INFO] Tests run: 28, Failures: 0, Errors: 0, Skipped: 0, Time elapsed: 808.228 s - in org.eclipse.jgit.api.EolRepositoryTest
[INFO] Tests run: 5, Failures: 0, Errors: 0, Skipped: 0, Time elapsed: 889.389 s - in org.eclipse.jgit.internal.storage.pack.GcCommitSelectionTest
[INFO] 
[INFO] Results:
[INFO] 
[ERROR] Failures: 
[ERROR]   RacyGitTests.testRacyGitDetection:171 expected:<...de:100644, time:t1, [smudged, length:0], content:a2][b, mod...> but was:<...de:100644, time:t1, [length:2], content:a2][b, mod...>
[INFO] 
[ERROR] Tests run: 3950, Failures: 1, Errors: 0, Skipped: 64
[INFO] 
[INFO] ------------------------------------------------------------------------
[INFO] Reactor Summary:
[INFO] 
[INFO] JGit - Parent ...................................... SUCCESS [ 19.356 s]
[INFO] JGit - Core ........................................ SUCCESS [03:32 min]
[INFO] JGit - Ant Tasks ................................... SUCCESS [ 23.835 s]
[INFO] JGit - Archive Formats ............................. SUCCESS [ 35.645 s]
[INFO] JGit - AWT User Interface .......................... SUCCESS [ 38.670 s]
[INFO] JGit - Apache httpclient based HTTP support ........ SUCCESS [ 35.150 s]
[INFO] JGit - HTTP Server ................................. SUCCESS [ 39.453 s]
[INFO] JGit - Large File Storage .......................... SUCCESS [ 38.737 s]
[INFO] JGit - Large File Storage Server ................... SUCCESS [ 21.985 s]
[INFO] JGit - Command Line Interface ...................... SUCCESS [ 45.508 s]
[INFO] JGit - JUnit Utility Classes ....................... SUCCESS [ 38.727 s]
[INFO] JGit - JUnit Http Utility Classes .................. SUCCESS [ 21.863 s]
[INFO] JGit - Core Tests .................................. FAILURE [16:03 min]
[INFO] JGit - Ant Tasks Tests ............................. SUCCESS [  8.038 s]
[INFO] JGit - HTTP Tests .................................. SUCCESS [08:49 min]
[INFO] JGit - Command Line Interface Tests ................ SUCCESS [02:11 min]
[INFO] JGit - Large File Storage Tests .................... SUCCESS [ 19.285 s]
[INFO] JGit - LFS Server Tests ............................ SUCCESS [ 30.804 s]
[INFO] ------------------------------------------------------------------------
[INFO] BUILD FAILURE
[INFO] ------------------------------------------------------------------------
[INFO] Total time: 21:42 min (Wall Clock)
[INFO] Finished at: 2019-03-12T23:15:51-04:00
[INFO] Final Memory: 97M/1686M
[INFO] ------------------------------------------------------------------------
[WARNING] The requested profile "ecj" could not be activated because it does not exist.
[ERROR] Failed to execute goal org.apache.maven.plugins:maven-surefire-plugin:2.20.1:test (default-test) on project org.eclipse.jgit.test: There are test failures.
[ERROR] 
[ERROR] Please refer to /jobs/genie.jgit/stable/jobs/jgit-stable/workspace/org.eclipse.jgit.test/target/surefire-reports for the individual test results.
[ERROR] Please refer to dump files (if any exist) [date]-jvmRun[N].dump, [date].dumpstream and [date]-jvmRun[N].dumpstream.
[ERROR] -> [Help 1]
[ERROR] 
[ERROR] To see the full stack trace of the errors, re-run Maven with the -e switch.
[ERROR] Re-run Maven using the -X switch to enable full debug logging.
[ERROR] 
[ERROR] For more information about the errors and possible solutions, please read the following articles:
[ERROR] [Help 1] http://cwiki.apache.org/confluence/display/MAVEN/MojoFailureException
[ERROR] 
[ERROR] After correcting the problems, you can resume the build with the command
[ERROR]   mvn <goals> -rf :org.eclipse.jgit.test
Build step 'Invoke top-level Maven targets' marked build as failure


Back to the top