Skip to main content

[Date Prev][Date Next][Thread Prev][Thread Next][Date Index][Thread Index] [List Home]
[ice-build] [Hudson] Build failed in Hudson: ice-next #357

See <http://hudson.eclipse.org/ice/job/ice-next/357/>

------------------------------------------
[...truncated 5708 lines...]
Drawing fake plot... 0
Drawing plot with index 0
Drawing fake plot... 0
Drawing plot with index 1
Rejecting plot because not enough space
Rejecting plot because is null
Drawing fake plot... 0
Drawing plot with index 1
679885815
Drawing fake plot... 0
Drawing plot with index 0
679885815
Drawing fake plot... 0
Drawing plot with index 1
Drawing fake plot... 0
Drawing plot with index 2
Drawing fake plot... 0
Drawing plot with index 0
Rejecting plot because not enough space
Rejecting plot because is null
Rejecting plot because is null
Drawing fake plot... 0
Exception while drawing plot
Drawing fake plot... 0
Drawing plot with index 0
Drawing fake plot... 0
Drawing plot with index 1
Drawing fake plot... 0
Drawing plot with index 0
Drawing fake plot... 0
Drawing plot with index 1
Drawing fake plot... 0
Drawing plot with index 2
Drawing fake plot... 0
Drawing plot with index 0
Drawing fake plot... 0
Drawing plot with index 1
Tests run: 10, Failures: 0, Errors: 0, Skipped: 2, Time elapsed: 1.768 sec - in org.eclipse.eavp.viz.service.widgets.test.PlotGridCompositeTester
checkRemovePlot(org.eclipse.eavp.viz.service.widgets.test.PlotGridCompositeTester)  Time elapsed: 0.247 sec
checkCloseButton(org.eclipse.eavp.viz.service.widgets.test.PlotGridCompositeTester) skipped
checkRemovePlots(org.eclipse.eavp.viz.service.widgets.test.PlotGridCompositeTester)  Time elapsed: 0.12 sec
checkContextMenu(org.eclipse.eavp.viz.service.widgets.test.PlotGridCompositeTester) skipped
checkAddPlot(org.eclipse.eavp.viz.service.widgets.test.PlotGridCompositeTester)  Time elapsed: 0.117 sec
checkToolBar(org.eclipse.eavp.viz.service.widgets.test.PlotGridCompositeTester)  Time elapsed: 0.054 sec
checkAddPlotFailures(org.eclipse.eavp.viz.service.widgets.test.PlotGridCompositeTester)  Time elapsed: 0.005 sec
checkClearPlotsButton(org.eclipse.eavp.viz.service.widgets.test.PlotGridCompositeTester)  Time elapsed: 0.785 sec
checkTrimmingPlots(org.eclipse.eavp.viz.service.widgets.test.PlotGridCompositeTester)  Time elapsed: 0.18 sec
checkClearPlots(org.eclipse.eavp.viz.service.widgets.test.PlotGridCompositeTester)  Time elapsed: 0.223 sec
Running org.eclipse.eavp.viz.service.widgets.test.PlotCompositeTester
Tests run: 1, Failures: 0, Errors: 0, Skipped: 1, Time elapsed: 0.001 sec - in org.eclipse.eavp.viz.service.widgets.test.PlotCompositeTester
org.eclipse.eavp.viz.service.widgets.test.PlotCompositeTester skipped
Running org.eclipse.eavp.viz.service.widgets.test.TimeSliderCompositeTester
Tests run: 23, Failures: 0, Errors: 0, Skipped: 3, Time elapsed: 33.09 sec - in org.eclipse.eavp.viz.service.widgets.test.TimeSliderCompositeTester
checkPlayWidgetNotifiesSelectionListeners(org.eclipse.eavp.viz.service.widgets.test.TimeSliderCompositeTester)  Time elapsed: 1.477 sec
checkTextNotifiesSelectionListeners(org.eclipse.eavp.viz.service.widgets.test.TimeSliderCompositeTester)  Time elapsed: 3.968 sec
checkPauseOnNewSelectionByWidget(org.eclipse.eavp.viz.service.widgets.test.TimeSliderCompositeTester)  Time elapsed: 5.315 sec
checkSetFPSByOptionsMenu(org.eclipse.eavp.viz.service.widgets.test.TimeSliderCompositeTester) skipped
checkSetTimestep(org.eclipse.eavp.viz.service.widgets.test.TimeSliderCompositeTester)  Time elapsed: 3.115 sec
checkDefaults(org.eclipse.eavp.viz.service.widgets.test.TimeSliderCompositeTester)  Time elapsed: 0.114 sec
checkWidgetsEnabled(org.eclipse.eavp.viz.service.widgets.test.TimeSliderCompositeTester)  Time elapsed: 0.133 sec
checkSpinnerNotifiesSelectionListeners(org.eclipse.eavp.viz.service.widgets.test.TimeSliderCompositeTester)  Time elapsed: 4.308 sec
checkScaleNotifiesSelectionListeners(org.eclipse.eavp.viz.service.widgets.test.TimeSliderCompositeTester)  Time elapsed: 3.208 sec
checkNullSelectionListenerExceptions(org.eclipse.eavp.viz.service.widgets.test.TimeSliderCompositeTester)  Time elapsed: 0.1 sec
checkInvalidThreadAccessExceptions(org.eclipse.eavp.viz.service.widgets.test.TimeSliderCompositeTester)  Time elapsed: 0.087 sec
checkSetTimes(org.eclipse.eavp.viz.service.widgets.test.TimeSliderCompositeTester)  Time elapsed: 0.312 sec
checkWidgetAppearance(org.eclipse.eavp.viz.service.widgets.test.TimeSliderCompositeTester)  Time elapsed: 1.297 sec
checkWidgetDisposedExceptions(org.eclipse.eavp.viz.service.widgets.test.TimeSliderCompositeTester)  Time elapsed: 0.091 sec
checkSetTimestepIndexException(org.eclipse.eavp.viz.service.widgets.test.TimeSliderCompositeTester)  Time elapsed: 0.081 sec
checkTextRejectsInvalidInput(org.eclipse.eavp.viz.service.widgets.test.TimeSliderCompositeTester)  Time elapsed: 1.709 sec
checkSetFPS(org.eclipse.eavp.viz.service.widgets.test.TimeSliderCompositeTester)  Time elapsed: 0.241 sec
checkPauseWhenSettersCalled(org.eclipse.eavp.viz.service.widgets.test.TimeSliderCompositeTester)  Time elapsed: 0.09 sec
checkPlayPauseMethods(org.eclipse.eavp.viz.service.widgets.test.TimeSliderCompositeTester)  Time elapsed: 4.159 sec
checkFirstAndLastStepButtonsNotifySelectionListeners(org.eclipse.eavp.viz.service.widgets.test.TimeSliderCompositeTester) skipped
checkSetLoopByOptionsMenu(org.eclipse.eavp.viz.service.widgets.test.TimeSliderCompositeTester) skipped
checkSetLoop(org.eclipse.eavp.viz.service.widgets.test.TimeSliderCompositeTester)  Time elapsed: 0.142 sec
checkSetTime(org.eclipse.eavp.viz.service.widgets.test.TimeSliderCompositeTester)  Time elapsed: 3.096 sec
Running org.eclipse.eavp.viz.service.widgets.test.BinarySearchTreeTester
Tests run: 16, Failures: 0, Errors: 0, Skipped: 0, Time elapsed: 0.007 sec - in org.eclipse.eavp.viz.service.widgets.test.BinarySearchTreeTester
checkInputIsSafe(org.eclipse.eavp.viz.service.widgets.test.BinarySearchTreeTester)  Time elapsed: 0 sec
checkFindSeventhElement(org.eclipse.eavp.viz.service.widgets.test.BinarySearchTreeTester)  Time elapsed: 0 sec
checkThreeNodeTree(org.eclipse.eavp.viz.service.widgets.test.BinarySearchTreeTester)  Time elapsed: 0 sec
checkFindSecondElement(org.eclipse.eavp.viz.service.widgets.test.BinarySearchTreeTester)  Time elapsed: 0 sec
checkGetValue(org.eclipse.eavp.viz.service.widgets.test.BinarySearchTreeTester)  Time elapsed: 0 sec
checkFindSixthElement(org.eclipse.eavp.viz.service.widgets.test.BinarySearchTreeTester)  Time elapsed: 0 sec
checkSize(org.eclipse.eavp.viz.service.widgets.test.BinarySearchTreeTester)  Time elapsed: 0 sec
checkSingleNodeTree(org.eclipse.eavp.viz.service.widgets.test.BinarySearchTreeTester)  Time elapsed: 0 sec
checkFindZerothElement(org.eclipse.eavp.viz.service.widgets.test.BinarySearchTreeTester)  Time elapsed: 0 sec
checkFindFirstElement(org.eclipse.eavp.viz.service.widgets.test.BinarySearchTreeTester)  Time elapsed: 0.001 sec
checkTwoNodeTree(org.eclipse.eavp.viz.service.widgets.test.BinarySearchTreeTester)  Time elapsed: 0 sec
checkGetValueIndexExceptions(org.eclipse.eavp.viz.service.widgets.test.BinarySearchTreeTester)  Time elapsed: 0 sec
checkFindFourthElement(org.eclipse.eavp.viz.service.widgets.test.BinarySearchTreeTester)  Time elapsed: 0 sec
checkFindThirdElement(org.eclipse.eavp.viz.service.widgets.test.BinarySearchTreeTester)  Time elapsed: 0 sec
checkConstructorExceptions(org.eclipse.eavp.viz.service.widgets.test.BinarySearchTreeTester)  Time elapsed: 0 sec
checkFindFifthElement(org.eclipse.eavp.viz.service.widgets.test.BinarySearchTreeTester)  Time elapsed: 0 sec
Running org.eclipse.eavp.viz.service.widgets.test.ActionTreeTester
Tests run: 2, Failures: 0, Errors: 0, Skipped: 0, Time elapsed: 0.003 sec - in org.eclipse.eavp.viz.service.widgets.test.ActionTreeTester
checkTree(org.eclipse.eavp.viz.service.widgets.test.ActionTreeTester)  Time elapsed: 0.001 sec
checkSingleNode(org.eclipse.eavp.viz.service.widgets.test.ActionTreeTester)  Time elapsed: 0.001 sec
Running org.eclipse.eavp.viz.service.widgets.test.ComboDialogTester
Tests run: 1, Failures: 0, Errors: 0, Skipped: 1, Time elapsed: 0.001 sec - in org.eclipse.eavp.viz.service.widgets.test.ComboDialogTester
org.eclipse.eavp.viz.service.widgets.test.ComboDialogTester skipped
Running org.eclipse.eavp.viz.service.internal.test.VizServiceFactoryHolderTester
Tests run: 1, Failures: 0, Errors: 0, Skipped: 0, Time elapsed: 0.002 sec - in org.eclipse.eavp.viz.service.internal.test.VizServiceFactoryHolderTester
checkFactorySetting(org.eclipse.eavp.viz.service.internal.test.VizServiceFactoryHolderTester)  Time elapsed: 0.002 sec

Results :

Tests in error: 
  PlotEditorTester.testPlotEditor:128 ยป WidgetNotFound Could not find widget mat...

Tests run: 314, Failures: 0, Errors: 1, Skipped: 8

Job found still running after platform shutdown.  Jobs should be canceled by the plugin that scheduled them during shutdown: org.eclipse.eavp.viz.service.connections.VizConnection$12
Job found still running after platform shutdown.  Jobs should be canceled by the plugin that scheduled them during shutdown: org.eclipse.eavp.viz.service.connections.VizConnection$10
Job found still running after platform shutdown.  Jobs should be canceled by the plugin that scheduled them during shutdown: org.eclipse.eavp.viz.service.connections.VizConnection$10
Job found still running after platform shutdown.  Jobs should be canceled by the plugin that scheduled them during shutdown: org.eclipse.eavp.viz.service.connections.VizConnection$10
Job found still running after platform shutdown.  Jobs should be canceled by the plugin that scheduled them during shutdown: org.eclipse.eavp.viz.service.connections.VizConnection$12
Job found still running after platform shutdown.  Jobs should be canceled by the plugin that scheduled them during shutdown: org.eclipse.eavp.viz.service.connections.VizConnection$12
[INFO] ------------------------------------------------------------------------
[INFO] Reactor Summary:
[INFO] 
[INFO] org.eclipse.ice.build ............................. SUCCESS [0.439s]
[INFO] org.eclipse.eavp.viz.service ...................... SUCCESS [11.042s]
[INFO] org.eclipse.eavp.viz.service.mesh ................. SUCCESS [27.737s]
[INFO] org.eclipse.ice.datastructures .................... SUCCESS [1.990s]
[INFO] org.eclipse.ice.io ................................ SUCCESS [1.613s]
[INFO] org.eclipse.ice.materials ......................... SUCCESS [1.717s]
[INFO] org.eclipse.ice.item .............................. SUCCESS [4.450s]
[INFO] org.eclipse.ice.caebat.batml ...................... SUCCESS [1.922s]
[INFO] org.eclipse.ice.caebat.batml.test ................. SUCCESS [8:35.598s]
[INFO] org.eclipse.ice.client.compatibility .............. SUCCESS [1.184s]
[INFO] org.eclipse.ice.core .............................. SUCCESS [1.478s]
[INFO] org.eclipse.ice.client ............................ SUCCESS [2.283s]
[INFO] org.eclipse.eavp.viz.service.geometry ............. SUCCESS [1.877s]
[INFO] org.eclipse.ice.client.rcp ........................ SUCCESS [1.725s]
[INFO] org.eclipse.ice.client.widgets .................... SUCCESS [3.333s]
[INFO] org.eclipse.ice.client.test ....................... SUCCESS [12.207s]
[INFO] org.eclipse.eavp.viz.service.javafx ............... SUCCESS [1.684s]
[INFO] org.eclipse.eavp.viz.service.javafx.geometry ...... SUCCESS [2.214s]
[INFO] org.eclipse.ice.persistence.xml ................... SUCCESS [1.649s]
[INFO] org.eclipse.ice.reactor.plant ..................... SUCCESS [1.810s]
[INFO] org.eclipse.ice.client.widgets.moose .............. SUCCESS [2.071s]
[INFO] org.eclipse.ice.vibe .............................. SUCCESS [1.296s]
[INFO] org.eclipse.ice.persistence.xml.test .............. SUCCESS [30.362s]
[INFO] org.eclipse.ice.client.widgets.moose.test ......... SUCCESS [1.634s]
[INFO] org.eclipse.ice.client.widgets.test.utils ......... SUCCESS [1.843s]
[INFO] org.eclipse.ice.client.widgets.test ............... SUCCESS [18.807s]
[INFO] org.eclipse.ice.core.test ......................... SUCCESS [11.378s]
[INFO] org.eclipse.ice.datastructures.test ............... SUCCESS [2:26.252s]
[INFO] org.eclipse.ice.developer ......................... SUCCESS [1.621s]
[INFO] org.eclipse.ice.developer.moose ................... SUCCESS [1.599s]
[INFO] org.eclipse.ice.io.test ........................... SUCCESS [4.072s]
[INFO] org.eclipse.ice.item.test ......................... SUCCESS [9.516s]
[INFO] org.eclipse.ice.materials.test .................... SUCCESS [3.790s]
[INFO] org.eclipse.ice.materials.ui ...................... SUCCESS [1.873s]
[INFO] org.eclipse.ice.reflectivity ...................... SUCCESS [1.404s]
[INFO] org.eclipse.ice.reflectivity.ui ................... SUCCESS [1.777s]
[INFO] ICE Advanced Materials Feature .................... SUCCESS [1.395s]
[INFO] org.eclipse.ice.mesh .............................. SUCCESS [9.329s]
[INFO] org.eclipse.ice.mesh.test ......................... SUCCESS [5.596s]
[INFO] org.eclipse.ice.nek5000 ........................... SUCCESS [3.015s]
[INFO] org.eclipse.ice.nek5000.test ...................... SUCCESS [4.976s]
[INFO] org.eclipse.ice.projectgeneration ................. SUCCESS [1.594s]
[INFO] org.eclipse.ice.projectgeneration.test ............ SUCCESS [13.478s]
[INFO] org.eclipse.ice.proteus ........................... SUCCESS [1.572s]
[INFO] org.eclipse.ice.proteus.test ...................... SUCCESS [8.140s]
[INFO] org.eclipse.ice.reactor.plant.test ................ SUCCESS [10.829s]
[INFO] org.eclipse.ice.reflectivity.test ................. SUCCESS [5.072s]
[INFO] org.eclipse.ice.target.mars ....................... SUCCESS [0.116s]
[INFO] org.eclipse.ice.vibe.test ......................... SUCCESS [4.518s]
[INFO] org.eclipse.eavp.viz.service.javafx.mesh .......... SUCCESS [1.680s]
[INFO] org.eclipse.eavp.viz.service.paraview.web ......... SUCCESS [1.399s]
[INFO] org.eclipse.eavp.viz.service.paraview ............. SUCCESS [1.728s]
[INFO] org.eclipse.eavp.viz .............................. SUCCESS [1.844s]
[INFO] org.eclipse.eavp.viz.service.visit ................ SUCCESS [1.846s]
[INFO] ICE Feature ....................................... SUCCESS [0.378s]
[INFO] org.eclipse.eavp.viz.service.test ................. FAILURE [1:29.794s]
[INFO] org.eclipse.eavp.viz.service.geometry.test ........ SKIPPED
[INFO] org.eclipse.eavp.viz.service.javafx.geometry.test . SKIPPED
[INFO] org.eclipse.eavp.viz.service.javafx.test .......... SKIPPED
[INFO] org.eclipse.eavp.viz.service.mesh.test ............ SKIPPED
[INFO] org.eclipse.eavp.viz.service.paraview.test ........ SKIPPED
[INFO] org.eclipse.eavp.viz.service.visit.test ........... SKIPPED
[INFO] org.eclipse.eavp.viz.test ......................... SKIPPED
[INFO] ICE Feature ....................................... SKIPPED
[INFO] ICE Infrastructure Product ........................ SKIPPED
[INFO] Eclipse ICE Build Aggregator ...................... SKIPPED
[INFO] ------------------------------------------------------------------------
[INFO] BUILD FAILURE
[INFO] ------------------------------------------------------------------------
[INFO] Total time: 20:05.060s
[INFO] Finished at: Mon Mar 14 02:55:45 EDT 2016
[INFO] Final Memory: 316M/10576M
[INFO] ------------------------------------------------------------------------
[INFO] o.h.m.e.h.MavenExecutionResultHandler - Build failed with exception(s)
[INFO] o.h.m.e.h.MavenExecutionResultHandler - [1] org.apache.maven.lifecycle.LifecycleExecutionException: Failed to execute goal org.eclipse.tycho:tycho-surefire-plugin:0.23.0:test (default-test) on project org.eclipse.eavp.viz.service.test: There are test failures.

Please refer to /jobs/genie.ice/ice-next/workspace/ice/org.eclipse.eavp.viz.service.test/target/surefire-reports for the individual test results.
[DEBUG] Closing connection to remote
[ERROR] Failed to execute goal org.eclipse.tycho:tycho-surefire-plugin:0.23.0:test (default-test) on project org.eclipse.eavp.viz.service.test: There are test failures.
[ERROR] 
[ERROR] Please refer to /jobs/genie.ice/ice-next/workspace/ice/org.eclipse.eavp.viz.service.test/target/surefire-reports for the individual test results.
[ERROR] -> [Help 1]
org.apache.maven.lifecycle.LifecycleExecutionException: Failed to execute goal org.eclipse.tycho:tycho-surefire-plugin:0.23.0:test (default-test) on project org.eclipse.eavp.viz.service.test: There are test failures.

Please refer to /jobs/genie.ice/ice-next/workspace/ice/org.eclipse.eavp.viz.service.test/target/surefire-reports for the individual test results.
	at org.apache.maven.lifecycle.internal.MojoExecutor.execute(MojoExecutor.java:212)
	at org.apache.maven.lifecycle.internal.MojoExecutor.execute(MojoExecutor.java:153)
	at org.apache.maven.lifecycle.internal.MojoExecutor.execute(MojoExecutor.java:145)
	at org.apache.maven.lifecycle.internal.LifecycleModuleBuilder.buildProject(LifecycleModuleBuilder.java:84)
	at org.apache.maven.lifecycle.internal.LifecycleModuleBuilder.buildProject(LifecycleModuleBuilder.java:59)
	at org.apache.maven.lifecycle.internal.LifecycleStarter.singleThreadedBuild(LifecycleStarter.java:183)
	at org.apache.maven.lifecycle.internal.LifecycleStarter.execute(LifecycleStarter.java:161)
	at org.apache.maven.DefaultMaven.doExecute(DefaultMaven.java:317)
	at org.apache.maven.DefaultMaven.execute(DefaultMaven.java:152)
	at org.apache.maven.cli.MavenCli.execute(MavenCli.java:555)
	at org.apache.maven.cli.MavenCli.doMain(MavenCli.java:214)
	at org.apache.maven.cli.MavenCli.main(MavenCli.java:158)
	at sun.reflect.NativeMethodAccessorImpl.invoke0(Native Method)
	at sun.reflect.NativeMethodAccessorImpl.invoke(NativeMethodAccessorImpl.java:62)
	at sun.reflect.DelegatingMethodAccessorImpl.invoke(DelegatingMethodAccessorImpl.java:43)
	at java.lang.reflect.Method.invoke(Method.java:497)
	at org.codehaus.plexus.classworlds.launcher.Launcher.launchEnhanced(Launcher.java:289)
	at org.codehaus.plexus.classworlds.launcher.Launcher.launch(Launcher.java:229)
	at org.codehaus.plexus.classworlds.launcher.Launcher.mainWithExitCode(Launcher.java:415)
	at org.codehaus.plexus.classworlds.launcher.Launcher.main(Launcher.java:356)
Caused by: org.apache.maven.plugin.MojoFailureException: There are test failures.

Please refer to /jobs/genie.ice/ice-next/workspace/ice/org.eclipse.eavp.viz.service.test/target/surefire-reports for the individual test results.
	at org.eclipse.tycho.surefire.TestMojo.runTest(TestMojo.java:945)
	at org.eclipse.tycho.surefire.TestMojo.execute(TestMojo.java:630)
	at org.apache.maven.plugin.DefaultBuildPluginManager.executeMojo(DefaultBuildPluginManager.java:106)
	at org.apache.maven.lifecycle.internal.MojoExecutor.execute(MojoExecutor.java:208)
	... 19 more
[ERROR] 
[ERROR] Re-run Maven using the -X switch to enable full debug logging.
[ERROR] 
[ERROR] For more information about the errors and possible solutions, please read the following articles:
[ERROR] [Help 1] http://cwiki.apache.org/confluence/display/MAVEN/MojoFailureException
[ERROR] 
[ERROR] After correcting the problems, you can resume the build with the command
[ERROR]   mvn <goals> -rf :org.eclipse.eavp.viz.service.test
[DEBUG] Waiting for process to finish
[DEBUG] Result: 1
Taking screenshot.
[workspace] $ import -window root -display :1529 screenshot.jpg
Terminating xvnc.
Recording test results
Archiving artifacts

--
This message is automatically generated by Hudson. 
For more information on Hudson, see: http://hudson-ci.org/


Back to the top