Skip to main content

[Date Prev][Date Next][Thread Prev][Thread Next][Date Index][Thread Index] [List Home]
[egit-build] [Hudson] Build failed in Hudson: egit #3747

See <https://hudson.eclipse.org/egit/job/egit/3747/changes>

Changes:

[Matthias Sohn] Replace use of deprecated TreeWalk.release()

[Matthias Sohn] Remove unnecessary redundant catch blocks

[Matthias Sohn] Replace deprecated RevWalk.close()

[Matthias Sohn] Replace deprecated SubmoduleWalk.release()

[Matthias Sohn] Replace deprecated ObjectReader.release()

[Andrey Loskutov] Avoid reacting on selection with null input

[Gunnar Wagenknecht] Fix behavior of EGit when repo is a symlink

------------------------------------------
[...truncated 1913 lines...]
Tests run: 5, Failures: 0, Errors: 0, Skipped: 0, Time elapsed: 1.872 sec - in org.eclipse.egit.ui.internal.synchronize.model.GitModelWorkingFileTest
shouldReturnNotEqualForDifferentLocation(org.eclipse.egit.ui.internal.synchronize.model.GitModelWorkingFileTest)  Time elapsed: 0.229 sec
shouldReturnNotEqualWhenComparingWorkingFileAndCacheFile(org.eclipse.egit.ui.internal.synchronize.model.GitModelWorkingFileTest)  Time elapsed: 0.438 sec
shouldReturnEqualForSameInstance(org.eclipse.egit.ui.internal.synchronize.model.GitModelWorkingFileTest)  Time elapsed: 0.387 sec
shouldReturnNotEqualWhenComparingWorkingFileAndBlob(org.eclipse.egit.ui.internal.synchronize.model.GitModelWorkingFileTest)  Time elapsed: 0.407 sec
shouldReturnEqualForSameLocation(org.eclipse.egit.ui.internal.synchronize.model.GitModelWorkingFileTest)  Time elapsed: 0.392 sec
Running org.eclipse.egit.ui.internal.synchronize.model.GitModelWorkingTreeTest
Tests run: 2, Failures: 0, Errors: 0, Skipped: 0, Time elapsed: 0.584 sec - in org.eclipse.egit.ui.internal.synchronize.model.GitModelWorkingTreeTest
shouldReturnNotEqualsWhenComparingWorkingTreeAndCache(org.eclipse.egit.ui.internal.synchronize.model.GitModelWorkingTreeTest)  Time elapsed: 0.381 sec
shouldReturnEqualsForTheSameInstance(org.eclipse.egit.ui.internal.synchronize.model.GitModelWorkingTreeTest)  Time elapsed: 0.196 sec
Running org.eclipse.egit.ui.internal.synchronize.model.GitModelCacheTest
Tests run: 6, Failures: 0, Errors: 0, Skipped: 0, Time elapsed: 3.145 sec - in org.eclipse.egit.ui.internal.synchronize.model.GitModelCacheTest
shouldReturnChildren(org.eclipse.egit.ui.internal.synchronize.model.GitModelCacheTest)  Time elapsed: 0.503 sec
shouldReturnNotEqualWhenCacheTreeAndCommit(org.eclipse.egit.ui.internal.synchronize.model.GitModelCacheTest)  Time elapsed: 0.703 sec
shouldReturnEqualForSameInstance(org.eclipse.egit.ui.internal.synchronize.model.GitModelCacheTest)  Time elapsed: 0.399 sec
shouldReturnEqualForSameCommits(org.eclipse.egit.ui.internal.synchronize.model.GitModelCacheTest)  Time elapsed: 0.4 sec
shouldReturnNotEqualWhenComparingCacheAndWorkingTree(org.eclipse.egit.ui.internal.synchronize.model.GitModelCacheTest)  Time elapsed: 0.383 sec
shouldReturnNotEqualForDifferentRepositories(org.eclipse.egit.ui.internal.synchronize.model.GitModelCacheTest)  Time elapsed: 0.733 sec
Running org.eclipse.egit.ui.internal.synchronize.model.GitModelTreeTest
Tests run: 6, Failures: 0, Errors: 0, Skipped: 0, Time elapsed: 2.435 sec - in org.eclipse.egit.ui.internal.synchronize.model.GitModelTreeTest
shouldReturnNotEqualForDifferentLocation(org.eclipse.egit.ui.internal.synchronize.model.GitModelTreeTest)  Time elapsed: 0.482 sec
shouldReturnNotEqualForTreeAndCacheTree(org.eclipse.egit.ui.internal.synchronize.model.GitModelTreeTest)  Time elapsed: 0.415 sec
shouldReturnNotEqualForTreeAndCommit(org.eclipse.egit.ui.internal.synchronize.model.GitModelTreeTest)  Time elapsed: 0.29 sec
shouldReturnEqualForSameBaseCommit(org.eclipse.egit.ui.internal.synchronize.model.GitModelTreeTest)  Time elapsed: 0.365 sec
shouldReturnEqualForSameInstance(org.eclipse.egit.ui.internal.synchronize.model.GitModelTreeTest)  Time elapsed: 0.364 sec
shouldReturnNotEqualForTreeAndBlob(org.eclipse.egit.ui.internal.synchronize.model.GitModelTreeTest)  Time elapsed: 0.502 sec
Running org.eclipse.egit.ui.prefpages.configuration.GlobalConfigurationPageTest
Tests run: 11, Failures: 0, Errors: 0, Skipped: 0, Time elapsed: 13.389 sec - in org.eclipse.egit.ui.prefpages.configuration.GlobalConfigurationPageTest
testAddSubSectionEntry(org.eclipse.egit.ui.prefpages.configuration.GlobalConfigurationPageTest)  Time elapsed: 1.557 sec
testAddSectionEntry(org.eclipse.egit.ui.prefpages.configuration.GlobalConfigurationPageTest)  Time elapsed: 0.996 sec
testCanCreateSameEntryValue(org.eclipse.egit.ui.prefpages.configuration.GlobalConfigurationPageTest)  Time elapsed: 1.332 sec
testNodes(org.eclipse.egit.ui.prefpages.configuration.GlobalConfigurationPageTest)  Time elapsed: 0.523 sec
testRemoveValue(org.eclipse.egit.ui.prefpages.configuration.GlobalConfigurationPageTest)  Time elapsed: 1.329 sec
testAddSubSectionEntryWithSuggestion(org.eclipse.egit.ui.prefpages.configuration.GlobalConfigurationPageTest)  Time elapsed: 1.321 sec
testOpenEditor(org.eclipse.egit.ui.prefpages.configuration.GlobalConfigurationPageTest)  Time elapsed: 0.823 sec
testSubsectionWithDot(org.eclipse.egit.ui.prefpages.configuration.GlobalConfigurationPageTest)  Time elapsed: 1.226 sec
testChecksForKey(org.eclipse.egit.ui.prefpages.configuration.GlobalConfigurationPageTest)  Time elapsed: 0.639 sec
testRemoveSubSection(org.eclipse.egit.ui.prefpages.configuration.GlobalConfigurationPageTest)  Time elapsed: 1.659 sec
testRemoveSection(org.eclipse.egit.ui.prefpages.configuration.GlobalConfigurationPageTest)  Time elapsed: 1.408 sec
Running org.eclipse.egit.ui.submodule.SubmoduleAddTest
Tests run: 1, Failures: 0, Errors: 0, Skipped: 0, Time elapsed: 2.667 sec - in org.eclipse.egit.ui.submodule.SubmoduleAddTest
addAtRoot(org.eclipse.egit.ui.submodule.SubmoduleAddTest)  Time elapsed: 2.659 sec
Running org.eclipse.egit.ui.submodule.SubmoduleSyncTest
Tests run: 1, Failures: 0, Errors: 0, Skipped: 0, Time elapsed: 4.008 sec - in org.eclipse.egit.ui.submodule.SubmoduleSyncTest
syncSubmodule(org.eclipse.egit.ui.submodule.SubmoduleSyncTest)  Time elapsed: 4 sec
Running org.eclipse.egit.ui.submodule.SubmoduleUpdateTest
Tests run: 1, Failures: 0, Errors: 0, Skipped: 0, Time elapsed: 3.918 sec - in org.eclipse.egit.ui.submodule.SubmoduleUpdateTest
updateSubmodule(org.eclipse.egit.ui.submodule.SubmoduleUpdateTest)  Time elapsed: 3.911 sec
Running org.eclipse.egit.ui.variables.DynamicVariablesTest
Tests run: 4, Failures: 0, Errors: 0, Skipped: 0, Time elapsed: 4.757 sec - in org.eclipse.egit.ui.variables.DynamicVariablesTest
testGitBranch(org.eclipse.egit.ui.variables.DynamicVariablesTest)  Time elapsed: 1.229 sec
testGitPath(org.eclipse.egit.ui.variables.DynamicVariablesTest)  Time elapsed: 1.13 sec
testGitWorkTree(org.eclipse.egit.ui.variables.DynamicVariablesTest)  Time elapsed: 1.127 sec
testGitDir(org.eclipse.egit.ui.variables.DynamicVariablesTest)  Time elapsed: 1.27 sec
Running org.eclipse.egit.ui.httpauth.PushTest
Tests run: 1, Failures: 0, Errors: 0, Skipped: 0, Time elapsed: 2.401 sec - in org.eclipse.egit.ui.httpauth.PushTest
testPush(org.eclipse.egit.ui.httpauth.PushTest)  Time elapsed: 2.4 sec
Running org.eclipse.egit.ui.view.repositories.GitRepositoriesViewTagHandlingTest
Tests run: 5, Failures: 0, Errors: 0, Skipped: 0, Time elapsed: 28.927 sec - in org.eclipse.egit.ui.view.repositories.GitRepositoriesViewTagHandlingTest
testDeleteTag(org.eclipse.egit.ui.view.repositories.GitRepositoriesViewTagHandlingTest)  Time elapsed: 5.594 sec
testCreateTags(org.eclipse.egit.ui.view.repositories.GitRepositoriesViewTagHandlingTest)  Time elapsed: 6.381 sec
testDeleteTags(org.eclipse.egit.ui.view.repositories.GitRepositoriesViewTagHandlingTest)  Time elapsed: 7.064 sec
testPushTagPreselectsTag(org.eclipse.egit.ui.view.repositories.GitRepositoriesViewTagHandlingTest)  Time elapsed: 3.843 sec
testResetToTag(org.eclipse.egit.ui.view.repositories.GitRepositoriesViewTagHandlingTest)  Time elapsed: 6.027 sec
Running org.eclipse.egit.ui.view.repositories.GitRepositoriesViewRepoHandlingTest
Tests run: 11, Failures: 0, Errors: 0, Skipped: 0, Time elapsed: 34.459 sec - in org.eclipse.egit.ui.view.repositories.GitRepositoriesViewRepoHandlingTest
testAddRepoButton(org.eclipse.egit.ui.view.repositories.GitRepositoriesViewRepoHandlingTest)  Time elapsed: 2.008 sec
testCreateRepository(org.eclipse.egit.ui.view.repositories.GitRepositoriesViewRepoHandlingTest)  Time elapsed: 4.392 sec
testPasteRepoPath(org.eclipse.egit.ui.view.repositories.GitRepositoriesViewRepoHandlingTest)  Time elapsed: 2.854 sec
testRemoveRepositoryWithProjectsYes(org.eclipse.egit.ui.view.repositories.GitRepositoriesViewRepoHandlingTest)  Time elapsed: 2.83 sec
testRemoveRepositoryWithoutProjects(org.eclipse.egit.ui.view.repositories.GitRepositoriesViewRepoHandlingTest)  Time elapsed: 2.714 sec
testSearchDirectoryWithBareRepos(org.eclipse.egit.ui.view.repositories.GitRepositoriesViewRepoHandlingTest)  Time elapsed: 1.856 sec
testCopyPathToClipboard(org.eclipse.egit.ui.view.repositories.GitRepositoriesViewRepoHandlingTest)  Time elapsed: 2.281 sec
testCloneRepoButton(org.eclipse.egit.ui.view.repositories.GitRepositoriesViewRepoHandlingTest)  Time elapsed: 5.489 sec
testRemoveRepositoryWithProjectsNo(org.eclipse.egit.ui.view.repositories.GitRepositoriesViewRepoHandlingTest)  Time elapsed: 3.28 sec
testRemoveRepositoryWithProjectsCancel(org.eclipse.egit.ui.view.repositories.GitRepositoriesViewRepoHandlingTest)  Time elapsed: 2.218 sec
testShowIn(org.eclipse.egit.ui.view.repositories.GitRepositoriesViewRepoHandlingTest)  Time elapsed: 4.506 sec
Running org.eclipse.egit.ui.view.repositories.GitRepositoriesViewTest
Tests run: 15, Failures: 0, Errors: 0, Skipped: 1, Time elapsed: 49.383 sec - in org.eclipse.egit.ui.view.repositories.GitRepositoriesViewTest
testDeleteSingleBranch(org.eclipse.egit.ui.view.repositories.GitRepositoriesViewTest)  Time elapsed: 4.926 sec
testLinkWithSelectionEditor(org.eclipse.egit.ui.view.repositories.GitRepositoriesViewTest) skipped
testExpandSymbolicRef(org.eclipse.egit.ui.view.repositories.GitRepositoriesViewTest)  Time elapsed: 2.707 sec
testOpen(org.eclipse.egit.ui.view.repositories.GitRepositoriesViewTest)  Time elapsed: 3.496 sec
testImportWizard(org.eclipse.egit.ui.view.repositories.GitRepositoriesViewTest)  Time elapsed: 3.903 sec
testShowProperties(org.eclipse.egit.ui.view.repositories.GitRepositoriesViewTest)  Time elapsed: 3.419 sec
testExpandWorkDir(org.eclipse.egit.ui.view.repositories.GitRepositoriesViewTest)  Time elapsed: 2.721 sec
testExpandFirstLevel(org.eclipse.egit.ui.view.repositories.GitRepositoriesViewTest)  Time elapsed: 2.546 sec
testDeleteFileNotInProject(org.eclipse.egit.ui.view.repositories.GitRepositoriesViewTest)  Time elapsed: 3.41 sec
testLinkWithSelectionNavigator(org.eclipse.egit.ui.view.repositories.GitRepositoriesViewTest)  Time elapsed: 4.113 sec
testDeleteFileInProject(org.eclipse.egit.ui.view.repositories.GitRepositoriesViewTest)  Time elapsed: 3.71 sec
testImportWizardGeneralProjectWithWorkingSet(org.eclipse.egit.ui.view.repositories.GitRepositoriesViewTest)  Time elapsed: 4.051 sec
testImportWizardGeneralProject(org.eclipse.egit.ui.view.repositories.GitRepositoriesViewTest)  Time elapsed: 3.507 sec
testContextMenuRepository(org.eclipse.egit.ui.view.repositories.GitRepositoriesViewTest)  Time elapsed: 2.273 sec
testDeleteMultipleBranches(org.eclipse.egit.ui.view.repositories.GitRepositoriesViewTest)  Time elapsed: 4.563 sec
Running org.eclipse.egit.ui.view.repositories.GitRepositoriesViewRemoteHandlingTest
Tests run: 2, Failures: 0, Errors: 0, Skipped: 0, Time elapsed: 23.945 sec - in org.eclipse.egit.ui.view.repositories.GitRepositoriesViewRemoteHandlingTest
testExpandRemotes(org.eclipse.egit.ui.view.repositories.GitRepositoriesViewRemoteHandlingTest)  Time elapsed: 6.883 sec
testConfigureRemote(org.eclipse.egit.ui.view.repositories.GitRepositoriesViewRemoteHandlingTest)  Time elapsed: 17.055 sec
Running org.eclipse.egit.ui.view.repositories.GitRepositoriesViewBranchHandlingTest
Tests run: 7, Failures: 0, Errors: 0, Skipped: 0, Time elapsed: 35.973 sec - in org.eclipse.egit.ui.view.repositories.GitRepositoriesViewBranchHandlingTest
testCreateDeleteLocalBranchWithUnmerged(org.eclipse.egit.ui.view.repositories.GitRepositoriesViewBranchHandlingTest)  Time elapsed: 8.862 sec
testMergeOnRepo(org.eclipse.egit.ui.view.repositories.GitRepositoriesViewBranchHandlingTest)  Time elapsed: 2.681 sec
testCheckoutRemote(org.eclipse.egit.ui.view.repositories.GitRepositoriesViewBranchHandlingTest)  Time elapsed: 3.258 sec
testRenameBranch(org.eclipse.egit.ui.view.repositories.GitRepositoriesViewBranchHandlingTest)  Time elapsed: 4.458 sec
testCreateCheckoutDeleteLocalBranch(org.eclipse.egit.ui.view.repositories.GitRepositoriesViewBranchHandlingTest)  Time elapsed: 10.878 sec
testClonedRepository(org.eclipse.egit.ui.view.repositories.GitRepositoriesViewBranchHandlingTest)  Time elapsed: 3.411 sec
testBranchConfiguration(org.eclipse.egit.ui.view.repositories.GitRepositoriesViewBranchHandlingTest)  Time elapsed: 2.389 sec
Running org.eclipse.egit.ui.view.repositories.GitRepositoriesViewRepoDeletionTest
Tests run: 2, Failures: 0, Errors: 0, Skipped: 0, Time elapsed: 6.859 sec - in org.eclipse.egit.ui.view.repositories.GitRepositoriesViewRepoDeletionTest
testDeleteSubmoduleRepository(org.eclipse.egit.ui.view.repositories.GitRepositoriesViewRepoDeletionTest)  Time elapsed: 3.836 sec
testDeleteRepositoryWithContentOk(org.eclipse.egit.ui.view.repositories.GitRepositoriesViewRepoDeletionTest)  Time elapsed: 3.019 sec
Running org.eclipse.egit.ui.view.repositories.GitRepositoriesViewFetchAndPushTest
Tests run: 4, Failures: 0, Errors: 1, Skipped: 0, Time elapsed: 33.115 sec <<< FAILURE! - in org.eclipse.egit.ui.view.repositories.GitRepositoriesViewFetchAndPushTest
testPushToOriginRemoteNode(org.eclipse.egit.ui.view.repositories.GitRepositoriesViewFetchAndPushTest)  Time elapsed: 2.963 sec  <<< ERROR!
org.eclipse.swtbot.swt.finder.exceptions.WidgetNotFoundException: Could not find node with text: Remotes
	at org.eclipse.swtbot.swt.finder.widgets.SWTBotTreeItem.getNodes(SWTBotTreeItem.java:334)
	at org.eclipse.swtbot.swt.finder.widgets.SWTBotTreeItem.getNode(SWTBotTreeItem.java:308)
	at org.eclipse.swtbot.swt.finder.widgets.SWTBotTreeItem.getNode(SWTBotTreeItem.java:346)
	at org.eclipse.egit.ui.view.repositories.GitRepositoriesViewTestUtils.getRemotesItem(GitRepositoriesViewTestUtils.java:151)
	at org.eclipse.egit.ui.view.repositories.GitRepositoriesViewFetchAndPushTest.selectNode(GitRepositoriesViewFetchAndPushTest.java:254)
	at org.eclipse.egit.ui.view.repositories.GitRepositoriesViewFetchAndPushTest.testPushToOrigin(GitRepositoriesViewFetchAndPushTest.java:111)
	at org.eclipse.egit.ui.view.repositories.GitRepositoriesViewFetchAndPushTest.testPushToOriginRemoteNode(GitRepositoriesViewFetchAndPushTest.java:89)

testFetchFromOriginFetchNode(org.eclipse.egit.ui.view.repositories.GitRepositoriesViewFetchAndPushTest)  Time elapsed: 7.634 sec
testFetchFromOriginRemoteNode(org.eclipse.egit.ui.view.repositories.GitRepositoriesViewFetchAndPushTest)  Time elapsed: 10.971 sec
testPushToOriginPushNode(org.eclipse.egit.ui.view.repositories.GitRepositoriesViewFetchAndPushTest)  Time elapsed: 11.233 sec
Running org.eclipse.egit.ui.view.synchronize.SynchronizeViewGitChangeSetModelTest
Tests run: 16, Failures: 0, Errors: 0, Skipped: 1, Time elapsed: 50.702 sec - in org.eclipse.egit.ui.view.synchronize.SynchronizeViewGitChangeSetModelTest
shouldListFileDeletedChange(org.eclipse.egit.ui.view.synchronize.SynchronizeViewGitChangeSetModelTest)  Time elapsed: 3.211 sec
shouldReturnListOfChanges(org.eclipse.egit.ui.view.synchronize.SynchronizeViewGitChangeSetModelTest)  Time elapsed: 3.198 sec
shouldShowNonWorkspaceFileInSynchronization(org.eclipse.egit.ui.view.synchronize.SynchronizeViewGitChangeSetModelTest)  Time elapsed: 1.817 sec
shouldRefreshSyncResultAfterRepositoryChange(org.eclipse.egit.ui.view.synchronize.SynchronizeViewGitChangeSetModelTest)  Time elapsed: 4.499 sec
shouldOpenCompareEditor(org.eclipse.egit.ui.view.synchronize.SynchronizeViewGitChangeSetModelTest)  Time elapsed: 3.903 sec
shouldLaunchSynchronizationFromGitRepositories(org.eclipse.egit.ui.view.synchronize.SynchronizeViewGitChangeSetModelTest) skipped
shouldShowCompareEditorForNonWorkspaceFileFromSynchronization(org.eclipse.egit.ui.view.synchronize.SynchronizeViewGitChangeSetModelTest)  Time elapsed: 2.605 sec
shouldSynchronizeInEmptyRepository(org.eclipse.egit.ui.view.synchronize.SynchronizeViewGitChangeSetModelTest)  Time elapsed: 1.83 sec
shouldUnStagePartialChangeInCompareEditor(org.eclipse.egit.ui.view.synchronize.SynchronizeViewGitChangeSetModelTest)  Time elapsed: 3.344 sec
shouldExchangeCompareEditorSidesBetweenIncomingAndOutgoingChanges(org.eclipse.egit.ui.view.synchronize.SynchronizeViewGitChangeSetModelTest)  Time elapsed: 8.126 sec
shouldCompareBranchAgainstTag(org.eclipse.egit.ui.view.synchronize.SynchronizeViewGitChangeSetModelTest)  Time elapsed: 3.526 sec
shouldNotShowIgnoredFiles(org.eclipse.egit.ui.view.synchronize.SynchronizeViewGitChangeSetModelTest)  Time elapsed: 1.943 sec
shouldCompareTagAgainstTag(org.eclipse.egit.ui.view.synchronize.SynchronizeViewGitChangeSetModelTest)  Time elapsed: 4.104 sec
shouldStagePartialChangeInCompareEditor(org.eclipse.egit.ui.view.synchronize.SynchronizeViewGitChangeSetModelTest)  Time elapsed: 3.691 sec
shouldRefreshSyncResultAfterWorkspaceChange(org.eclipse.egit.ui.view.synchronize.SynchronizeViewGitChangeSetModelTest)  Time elapsed: 2.047 sec
shouldReturnNoChanges(org.eclipse.egit.ui.view.synchronize.SynchronizeViewGitChangeSetModelTest)  Time elapsed: 2.637 sec
Running org.eclipse.egit.ui.view.synchronize.SynchronizeViewWorkspaceModelTest
Tests run: 13, Failures: 0, Errors: 0, Skipped: 2, Time elapsed: 37.249 sec - in org.eclipse.egit.ui.view.synchronize.SynchronizeViewWorkspaceModelTest
shouldListFileDeletedChange(org.eclipse.egit.ui.view.synchronize.SynchronizeViewWorkspaceModelTest)  Time elapsed: 2.619 sec
shouldReturnListOfChanges(org.eclipse.egit.ui.view.synchronize.SynchronizeViewWorkspaceModelTest)  Time elapsed: 2.557 sec
shouldShowNonWorkspaceFileInSynchronization(org.eclipse.egit.ui.view.synchronize.SynchronizeViewWorkspaceModelTest) skipped
shouldRefreshSyncResultAfterRepositoryChange(org.eclipse.egit.ui.view.synchronize.SynchronizeViewWorkspaceModelTest)  Time elapsed: 4.254 sec
shouldOpenCompareEditor(org.eclipse.egit.ui.view.synchronize.SynchronizeViewWorkspaceModelTest)  Time elapsed: 5.772 sec
shouldShowCompareEditorForNonWorkspaceFileFromSynchronization(org.eclipse.egit.ui.view.synchronize.SynchronizeViewWorkspaceModelTest) skipped
shouldSynchronizeInEmptyRepository(org.eclipse.egit.ui.view.synchronize.SynchronizeViewWorkspaceModelTest)  Time elapsed: 1.611 sec
shouldExchangeCompareEditorSidesBetweenIncomingAndOutgoingChanges(org.eclipse.egit.ui.view.synchronize.SynchronizeViewWorkspaceModelTest)  Time elapsed: 6.36 sec
shouldCompareBranchAgainstTag(org.eclipse.egit.ui.view.synchronize.SynchronizeViewWorkspaceModelTest)  Time elapsed: 3.527 sec
shouldNotShowIgnoredFiles(org.eclipse.egit.ui.view.synchronize.SynchronizeViewWorkspaceModelTest)  Time elapsed: 1.605 sec
shouldCompareTagAgainstTag(org.eclipse.egit.ui.view.synchronize.SynchronizeViewWorkspaceModelTest)  Time elapsed: 3.598 sec
shouldRefreshSyncResultAfterWorkspaceChange(org.eclipse.egit.ui.view.synchronize.SynchronizeViewWorkspaceModelTest)  Time elapsed: 2.037 sec
shouldReturnNoChanges(org.eclipse.egit.ui.view.synchronize.SynchronizeViewWorkspaceModelTest)  Time elapsed: 3.245 sec
Running org.eclipse.egit.ui.view.synchronize.SynchronizeViewPushTest
Tests run: 1, Failures: 0, Errors: 0, Skipped: 0, Time elapsed: 5.647 sec - in org.eclipse.egit.ui.view.synchronize.SynchronizeViewPushTest
shouldUpdateTrackingBranchOnPush(org.eclipse.egit.ui.view.synchronize.SynchronizeViewPushTest)  Time elapsed: 5.621 sec

Results :

Tests in error: 
  GitRepositoriesViewFetchAndPushTest.testPushToOriginRemoteNode:89->testPushToOrigin:111->selectNode:254 ยป WidgetNotFound

Tests run: 336, Failures: 0, Errors: 1, Skipped: 11

[INFO] ------------------------------------------------------------------------
[INFO] Reactor Summary:
[INFO] 
[INFO] EGit Parent ....................................... SUCCESS [5.568s]
[INFO] EGit Target Platform Definition ................... SUCCESS [1.076s]
[INFO] Eclipse EGit ...................................... SUCCESS [4.684s]
[INFO] Git Team Provider (Core) .......................... SUCCESS [34.567s]
[INFO] Git Team Provider (UI) ............................ SUCCESS [1:11.189s]
[INFO] EGit Mylyn UI ..................................... SUCCESS [15.368s]
[INFO] Git Team Provider (Documentation) ................. SUCCESS [6.034s]
[INFO] Eclipse EGit Feature .............................. SUCCESS [2.927s]
[INFO] EGit Mylyn Feature ................................ SUCCESS [3.187s]
[INFO] EGit Core Test Plug-in ............................ SUCCESS [1:09.462s]
[INFO] EGit UI Test Plug-in .............................. FAILURE [10:27.495s]
[INFO] EGit Mylyn UI Test Plug-in ........................ SKIPPED
[INFO] Eclipse EGit Source Feature ....................... SKIPPED
[INFO] EGit P2 Repository ................................ SKIPPED
[INFO] ------------------------------------------------------------------------
[INFO] BUILD FAILURE
[INFO] ------------------------------------------------------------------------
[INFO] Total time: 14:36.653s
[INFO] Finished at: Tue Mar 03 17:30:43 EST 2015
[INFO] Final Memory: 203M/3296M
[INFO] ------------------------------------------------------------------------
[INFO] o.h.m.e.h.MavenExecutionResultHandler - Build failed with exception(s)
[INFO] o.h.m.e.h.MavenExecutionResultHandler - [1] org.apache.maven.lifecycle.LifecycleExecutionException: Failed to execute goal org.eclipse.tycho:tycho-surefire-plugin:0.22.0:test (default-test) on project org.eclipse.egit.ui.test: There are test failures.

Please refer to /jobs/genie.egit/egit/workspace/org.eclipse.egit.ui.test/target/surefire-reports for the individual test results.
[DEBUG] Closing connection to remote
[ERROR] Failed to execute goal org.eclipse.tycho:tycho-surefire-plugin:0.22.0:test (default-test) on project org.eclipse.egit.ui.test: There are test failures.
[ERROR] 
[ERROR] Please refer to /jobs/genie.egit/egit/workspace/org.eclipse.egit.ui.test/target/surefire-reports for the individual test results.
[ERROR] -> [Help 1]
org.apache.maven.lifecycle.LifecycleExecutionException: Failed to execute goal org.eclipse.tycho:tycho-surefire-plugin:0.22.0:test (default-test) on project org.eclipse.egit.ui.test: There are test failures.

Please refer to /jobs/genie.egit/egit/workspace/org.eclipse.egit.ui.test/target/surefire-reports for the individual test results.
	at org.apache.maven.lifecycle.internal.MojoExecutor.execute(MojoExecutor.java:213)
	at org.apache.maven.lifecycle.internal.MojoExecutor.execute(MojoExecutor.java:153)
	at org.apache.maven.lifecycle.internal.MojoExecutor.execute(MojoExecutor.java:145)
	at org.apache.maven.lifecycle.internal.LifecycleModuleBuilder.buildProject(LifecycleModuleBuilder.java:84)
	at org.apache.maven.lifecycle.internal.LifecycleModuleBuilder.buildProject(LifecycleModuleBuilder.java:59)
	at org.apache.maven.lifecycle.internal.LifecycleStarter.singleThreadedBuild(LifecycleStarter.java:183)
	at org.apache.maven.lifecycle.internal.LifecycleStarter.execute(LifecycleStarter.java:161)
	at org.apache.maven.DefaultMaven.doExecute(DefaultMaven.java:320)
	at org.apache.maven.DefaultMaven.execute(DefaultMaven.java:156)
	at org.apache.maven.cli.MavenCli.execute(MavenCli.java:537)
	at org.apache.maven.cli.MavenCli.doMain(MavenCli.java:196)
	at org.apache.maven.cli.MavenCli.main(MavenCli.java:141)
	at sun.reflect.NativeMethodAccessorImpl.invoke0(Native Method)
	at sun.reflect.NativeMethodAccessorImpl.invoke(NativeMethodAccessorImpl.java:57)
	at sun.reflect.DelegatingMethodAccessorImpl.invoke(DelegatingMethodAccessorImpl.java:43)
	at java.lang.reflect.Method.invoke(Method.java:606)
	at org.codehaus.plexus.classworlds.launcher.Launcher.launchEnhanced(Launcher.java:290)
	at org.codehaus.plexus.classworlds.launcher.Launcher.launch(Launcher.java:230)
	at org.codehaus.plexus.classworlds.launcher.Launcher.mainWithExitCode(Launcher.java:409)
	at org.codehaus.plexus.classworlds.launcher.Launcher.main(Launcher.java:352)
Caused by: org.apache.maven.plugin.MojoFailureException: There are test failures.

Please refer to /jobs/genie.egit/egit/workspace/org.eclipse.egit.ui.test/target/surefire-reports for the individual test results.
	at org.eclipse.tycho.surefire.TestMojo.runTest(TestMojo.java:953)
	at org.eclipse.tycho.surefire.TestMojo.execute(TestMojo.java:627)
	at org.apache.maven.plugin.DefaultBuildPluginManager.executeMojo(DefaultBuildPluginManager.java:101)
	at org.apache.maven.lifecycle.internal.MojoExecutor.execute(MojoExecutor.java:209)
	... 19 more
[ERROR] 
[ERROR] Re-run Maven using the -X switch to enable full debug logging.
[ERROR] 
[ERROR] For more information about the errors and possible solutions, please read the following articles:
[ERROR] [Help 1] http://cwiki.apache.org/confluence/display/MAVEN/MojoFailureException
[ERROR] 
[ERROR] After correcting the problems, you can resume the build with the command
[ERROR]   mvn <goals> -rf :org.eclipse.egit.ui.test
[DEBUG] Waiting for process to finish
[DEBUG] Result: 1
Terminating xvnc.
[FINDBUGS] Skipping publisher since build result is FAILURE
[DRY] Skipping publisher since build result is FAILURE
Archiving artifacts
Recording test results

--
This message is automatically generated by Hudson. 
For more information on Hudson, see: http://hudson-ci.org/


Back to the top