Skip to main content

[Date Prev][Date Next][Thread Prev][Thread Next][Date Index][Thread Index] [List Home]
[egit-build] Build failed in Hudson: egit #1165

See <https://hudson.eclipse.org/hudson/job/egit/1165/>

------------------------------------------
[...truncated 2740 lines...]
	at org.junit.internal.runners.statements.InvokeMethod.evaluate(InvokeMethod.java:20)
	at org.junit.internal.runners.statements.RunBefores.evaluate(RunBefores.java:28)
	at org.junit.internal.runners.statements.RunAfters.evaluate(RunAfters.java:31)
	at org.junit.runners.BlockJUnit4ClassRunner.runChild(BlockJUnit4ClassRunner.java:76)
	at org.junit.runners.BlockJUnit4ClassRunner.runChild(BlockJUnit4ClassRunner.java:50)
	at org.junit.runners.ParentRunner$3.run(ParentRunner.java:193)
	at org.junit.runners.ParentRunner$1.schedule(ParentRunner.java:52)
	at org.junit.runners.ParentRunner.runChildren(ParentRunner.java:191)
	at org.junit.runners.ParentRunner.access$000(ParentRunner.java:42)
	at org.junit.runners.ParentRunner$2.evaluate(ParentRunner.java:184)
	at org.junit.internal.runners.statements.RunBefores.evaluate(RunBefores.java:28)
	at org.junit.internal.runners.statements.RunAfters.evaluate(RunAfters.java:31)
	at org.junit.runners.ParentRunner.run(ParentRunner.java:236)
	at org.eclipse.swtbot.swt.finder.junit.SWTBotJunit4ClassRunner.run(SWTBotJunit4ClassRunner.java:54)
	at org.junit.runners.Suite.runChild(Suite.java:128)
	at org.junit.runners.Suite.runChild(Suite.java:24)
	at org.junit.runners.ParentRunner$3.run(ParentRunner.java:193)
	at org.junit.runners.ParentRunner$1.schedule(ParentRunner.java:52)
	at org.junit.runners.ParentRunner.runChildren(ParentRunner.java:191)
	at org.junit.runners.ParentRunner.access$000(ParentRunner.java:42)
	at org.junit.runners.ParentRunner$2.evaluate(ParentRunner.java:184)
	at org.junit.runners.ParentRunner.run(ParentRunner.java:236)
	at org.junit.runners.Suite.runChild(Suite.java:128)
	at org.junit.runners.Suite.runChild(Suite.java:24)
	at org.junit.runners.ParentRunner$3.run(ParentRunner.java:193)
	at org.junit.runners.ParentRunner$1.schedule(ParentRunner.java:52)
	at org.junit.runners.ParentRunner.runChildren(ParentRunner.java:191)
	at org.junit.runners.ParentRunner.access$000(ParentRunner.java:42)
	at org.junit.runners.ParentRunner$2.evaluate(ParentRunner.java:184)
	at org.junit.runners.ParentRunner.run(ParentRunner.java:236)
	at org.junit.runners.Suite.runChild(Suite.java:128)
	at org.junit.runners.Suite.runChild(Suite.java:24)
	at org.junit.runners.ParentRunner$3.run(ParentRunner.java:193)
	at org.junit.runners.ParentRunner$1.schedule(ParentRunner.java:52)
	at org.junit.runners.ParentRunner.runChildren(ParentRunner.java:191)
	at org.junit.runners.ParentRunner.access$000(ParentRunner.java:42)
	at org.junit.runners.ParentRunner$2.evaluate(ParentRunner.java:184)
	at org.junit.runners.ParentRunner.run(ParentRunner.java:236)
	at org.apache.maven.surefire.junit4.JUnit4TestSet.execute(JUnit4TestSet.java:62)
	at org.apache.maven.surefire.suite.AbstractDirectoryTestSuite.executeTestSet(AbstractDirectoryTestSuite.java:140)
	at org.apache.maven.surefire.suite.AbstractDirectoryTestSuite.execute(AbstractDirectoryTestSuite.java:127)
	at org.apache.maven.surefire.Surefire.run(Surefire.java:177)
	at org.codehaus.tycho.surefire.osgibooter.OsgiSurefireBooter.run(OsgiSurefireBooter.java:75)
	at org.codehaus.tycho.surefire.osgibooter.AbstractUITestApplication.runTests(AbstractUITestApplication.java:34)
	at org.eclipse.ui.internal.testing.WorkbenchTestable$1.run(WorkbenchTestable.java:71)
	at java.lang.Thread.run(Thread.java:619)

testCopyPathToClipboard(org.eclipse.egit.ui.view.repositories.GitRepositoriesViewRepoHandlingTest)  Time elapsed: 1.527 sec  <<< ERROR!
org.eclipse.swt.SWTException: Failed to execute runnable (java.lang.NullPointerException)
	at org.eclipse.swt.SWT.error(SWT.java:4083)
	at org.eclipse.swt.SWT.error(SWT.java:3998)
	at org.eclipse.swt.widgets.Synchronizer.syncExec(Synchronizer.java:195)
	at org.eclipse.ui.internal.UISynchronizer.syncExec(UISynchronizer.java:150)
	at org.eclipse.swt.widgets.Display.syncExec(Display.java:4282)
	at org.eclipse.egit.ui.view.repositories.GitRepositoriesViewRepoHandlingTest.testCopyPathToClipboard(GitRepositoriesViewRepoHandlingTest.java:67)
	at sun.reflect.NativeMethodAccessorImpl.invoke0(Native Method)
	at sun.reflect.NativeMethodAccessorImpl.invoke(NativeMethodAccessorImpl.java:39)
	at sun.reflect.DelegatingMethodAccessorImpl.invoke(DelegatingMethodAccessorImpl.java:25)
	at java.lang.reflect.Method.invoke(Method.java:597)
	at org.junit.runners.model.FrameworkMethod$1.runReflectiveCall(FrameworkMethod.java:44)
	at org.junit.internal.runners.model.ReflectiveCallable.run(ReflectiveCallable.java:15)
	at org.junit.runners.model.FrameworkMethod.invokeExplosively(FrameworkMethod.java:41)
	at org.junit.internal.runners.statements.InvokeMethod.evaluate(InvokeMethod.java:20)
	at org.junit.internal.runners.statements.RunAfters.evaluate(RunAfters.java:31)
	at org.junit.runners.BlockJUnit4ClassRunner.runChild(BlockJUnit4ClassRunner.java:76)
	at org.junit.runners.BlockJUnit4ClassRunner.runChild(BlockJUnit4ClassRunner.java:50)
	at org.junit.runners.ParentRunner$3.run(ParentRunner.java:193)
	at org.junit.runners.ParentRunner$1.schedule(ParentRunner.java:52)
	at org.junit.runners.ParentRunner.runChildren(ParentRunner.java:191)
	at org.junit.runners.ParentRunner.access$000(ParentRunner.java:42)
	at org.junit.runners.ParentRunner$2.evaluate(ParentRunner.java:184)
	at org.junit.internal.runners.statements.RunBefores.evaluate(RunBefores.java:28)
	at org.junit.internal.runners.statements.RunAfters.evaluate(RunAfters.java:31)
	at org.junit.runners.ParentRunner.run(ParentRunner.java:236)
	at org.eclipse.swtbot.swt.finder.junit.SWTBotJunit4ClassRunner.run(SWTBotJunit4ClassRunner.java:54)
	at org.junit.runners.Suite.runChild(Suite.java:128)
	at org.junit.runners.Suite.runChild(Suite.java:24)
	at org.junit.runners.ParentRunner$3.run(ParentRunner.java:193)
	at org.junit.runners.ParentRunner$1.schedule(ParentRunner.java:52)
	at org.junit.runners.ParentRunner.runChildren(ParentRunner.java:191)
	at org.junit.runners.ParentRunner.access$000(ParentRunner.java:42)
	at org.junit.runners.ParentRunner$2.evaluate(ParentRunner.java:184)
	at org.junit.runners.ParentRunner.run(ParentRunner.java:236)
	at org.junit.runners.Suite.runChild(Suite.java:128)
	at org.junit.runners.Suite.runChild(Suite.java:24)
	at org.junit.runners.ParentRunner$3.run(ParentRunner.java:193)
	at org.junit.runners.ParentRunner$1.schedule(ParentRunner.java:52)
	at org.junit.runners.ParentRunner.runChildren(ParentRunner.java:191)
	at org.junit.runners.ParentRunner.access$000(ParentRunner.java:42)
	at org.junit.runners.ParentRunner$2.evaluate(ParentRunner.java:184)
	at org.junit.runners.ParentRunner.run(ParentRunner.java:236)
	at org.junit.runners.Suite.runChild(Suite.java:128)
	at org.junit.runners.Suite.runChild(Suite.java:24)
	at org.junit.runners.ParentRunner$3.run(ParentRunner.java:193)
	at org.junit.runners.ParentRunner$1.schedule(ParentRunner.java:52)
	at org.junit.runners.ParentRunner.runChildren(ParentRunner.java:191)
	at org.junit.runners.ParentRunner.access$000(ParentRunner.java:42)
	at org.junit.runners.ParentRunner$2.evaluate(ParentRunner.java:184)
	at org.junit.runners.ParentRunner.run(ParentRunner.java:236)
	at org.apache.maven.surefire.junit4.JUnit4TestSet.execute(JUnit4TestSet.java:62)
	at org.apache.maven.surefire.suite.AbstractDirectoryTestSuite.executeTestSet(AbstractDirectoryTestSuite.java:140)
	at org.apache.maven.surefire.suite.AbstractDirectoryTestSuite.execute(AbstractDirectoryTestSuite.java:127)
	at org.apache.maven.surefire.Surefire.run(Surefire.java:177)
	at org.codehaus.tycho.surefire.osgibooter.OsgiSurefireBooter.run(OsgiSurefireBooter.java:75)
	at org.codehaus.tycho.surefire.osgibooter.AbstractUITestApplication.runTests(AbstractUITestApplication.java:34)
	at org.eclipse.ui.internal.testing.WorkbenchTestable$1.run(WorkbenchTestable.java:71)
	at java.lang.Thread.run(Thread.java:619)
Caused by: java.lang.NullPointerException
	at org.eclipse.egit.ui.internal.repository.tree.command.RepositoriesViewCommandHandler.enableWhenRepositoryHaveHead(RepositoriesViewCommandHandler.java:71)
	at org.eclipse.egit.ui.internal.repository.tree.command.PushCommand.setEnabled(PushCommand.java:42)
	at org.eclipse.ui.internal.handlers.HandlerProxy.setEnabled(HandlerProxy.java:232)
	at org.eclipse.core.commands.Command.setEnabled(Command.java:857)
	at org.eclipse.ui.menus.CommandContributionItem.isEnabled(CommandContributionItem.java:968)
	at org.eclipse.ui.menus.CommandContributionItem.updateMenuItem(CommandContributionItem.java:624)
	at org.eclipse.ui.menus.CommandContributionItem.update(CommandContributionItem.java:576)
	at org.eclipse.ui.menus.CommandContributionItem.fill(CommandContributionItem.java:486)
	at org.eclipse.jface.action.MenuManager.doItemFill(MenuManager.java:737)
	at org.eclipse.jface.action.MenuManager.update(MenuManager.java:818)
	at org.eclipse.jface.action.MenuManager.handleAboutToShow(MenuManager.java:470)
	at org.eclipse.jface.action.MenuManager.access$1(MenuManager.java:465)
	at org.eclipse.jface.action.MenuManager$2.menuShown(MenuManager.java:491)
	at org.eclipse.swt.widgets.TypedListener.handleEvent(TypedListener.java:241)
	at org.eclipse.swt.widgets.EventTable.sendEvent(EventTable.java:84)
	at org.eclipse.swt.widgets.Widget.sendEvent(Widget.java:1258)
	at org.eclipse.swt.widgets.Widget.sendEvent(Widget.java:1282)
	at org.eclipse.swt.widgets.Widget.sendEvent(Widget.java:1267)
	at org.eclipse.swt.widgets.Widget.notifyListeners(Widget.java:1061)
	at org.eclipse.egit.ui.test.ContextMenuHelper.show(ContextMenuHelper.java:157)
	at org.eclipse.egit.ui.test.ContextMenuHelper.getMenuItem(ContextMenuHelper.java:96)
	at org.eclipse.egit.ui.test.ContextMenuHelper.access$0(ContextMenuHelper.java:84)
	at org.eclipse.egit.ui.test.ContextMenuHelper$1.run(ContextMenuHelper.java:57)
	at org.eclipse.egit.ui.test.ContextMenuHelper$1.run(ContextMenuHelper.java:1)
	at org.eclipse.swtbot.swt.finder.finders.UIThreadRunnable$2.doRun(UIThreadRunnable.java:140)
	at org.eclipse.swtbot.swt.finder.finders.UIThreadRunnable.run(UIThreadRunnable.java:78)
	at org.eclipse.swtbot.swt.finder.finders.UIThreadRunnable.syncExec(UIThreadRunnable.java:142)
	at org.eclipse.swtbot.swt.finder.finders.UIThreadRunnable.syncExec(UIThreadRunnable.java:125)
	at org.eclipse.egit.ui.test.ContextMenuHelper.clickContextMenu(ContextMenuHelper.java:55)
	at org.eclipse.egit.ui.view.repositories.GitRepositoriesViewRepoHandlingTest$1.run(GitRepositoriesViewRepoHandlingTest.java:78)
	at org.eclipse.swt.widgets.RunnableLock.run(RunnableLock.java:35)
	at org.eclipse.swt.widgets.Synchronizer.runAsyncMessages(Synchronizer.java:134)
	at org.eclipse.swt.widgets.Display.runAsyncMessages(Display.java:3515)
	at org.eclipse.swt.widgets.Display.readAndDispatch(Display.java:3164)
	at org.eclipse.ui.internal.Workbench.runEventLoop(Workbench.java:2640)
	at org.eclipse.ui.internal.Workbench.runUI(Workbench.java:2604)
	at org.eclipse.ui.internal.Workbench.access$4(Workbench.java:2438)
	at org.eclipse.ui.internal.Workbench$7.run(Workbench.java:671)
	at org.eclipse.core.databinding.observable.Realm.runWithDefault(Realm.java:332)
	at org.eclipse.ui.internal.Workbench.createAndRunWorkbench(Workbench.java:664)
	at org.eclipse.ui.PlatformUI.createAndRunWorkbench(PlatformUI.java:149)
	at org.eclipse.ui.internal.ide.application.IDEApplication.start(IDEApplication.java:115)
	at org.codehaus.tycho.surefire.osgibooter.UITestApplication.runApplication(UITestApplication.java:21)
	at org.codehaus.tycho.surefire.osgibooter.AbstractUITestApplication.run(AbstractUITestApplication.java:109)
	at org.codehaus.tycho.surefire.osgibooter.UITestApplication.start(UITestApplication.java:27)
	at org.eclipse.equinox.internal.app.EclipseAppHandle.run(EclipseAppHandle.java:196)
	at org.eclipse.core.runtime.internal.adaptor.EclipseAppLauncher.runApplication(EclipseAppLauncher.java:110)
	at org.eclipse.core.runtime.internal.adaptor.EclipseAppLauncher.start(EclipseAppLauncher.java:79)
	at org.eclipse.core.runtime.adaptor.EclipseStarter.run(EclipseStarter.java:369)
	at org.eclipse.core.runtime.adaptor.EclipseStarter.run(EclipseStarter.java:179)
	at sun.reflect.NativeMethodAccessorImpl.invoke0(Native Method)
	at sun.reflect.NativeMethodAccessorImpl.invoke(NativeMethodAccessorImpl.java:39)
	at sun.reflect.DelegatingMethodAccessorImpl.invoke(DelegatingMethodAccessorImpl.java:25)
	at java.lang.reflect.Method.invoke(Method.java:597)
	at org.eclipse.equinox.launcher.Main.invokeFramework(Main.java:620)
	at org.eclipse.equinox.launcher.Main.basicRun(Main.java:575)
	at org.eclipse.equinox.launcher.Main.run(Main.java:1408)
	at org.eclipse.equinox.launcher.Main.main(Main.java:1384)


Results :

Tests in error: 
  testCheckoutRemote(org.eclipse.egit.ui.view.repositories.GitRepositoriesViewBranchHandlingTest)
  testRenameBranch(org.eclipse.egit.ui.view.repositories.GitRepositoriesViewBranchHandlingTest)
  testMergeOnRepo(org.eclipse.egit.ui.view.repositories.GitRepositoriesViewBranchHandlingTest)
  testCopyPathToClipboard(org.eclipse.egit.ui.view.repositories.GitRepositoriesViewRepoHandlingTest)

Tests run: 120, Failures: 0, Errors: 4, Skipped: 3

[INFO] ------------------------------------------------------------------------
[INFO] Reactor Summary:
[INFO] 
[INFO] EGit Parent (Incubation) .......................... SUCCESS [0.224s]
[INFO] Eclipse Git (Incubation) .......................... SUCCESS [3.745s]
[INFO] Git Team Provider (Core) (Incubation) ............. SUCCESS [24.941s]
[INFO] Git Team Provider (UI) (Incubation) ............... SUCCESS [55.436s]
[INFO] EGit Mylyn UI (Incubation) ........................ SUCCESS [10.755s]
[INFO] EGit Mylyn Feature (Incubation) ................... SUCCESS [3.837s]
[INFO] Git Team Provider (Documentation) (Incubation) .... SUCCESS [4.293s]
[INFO] Eclipse Git Feature (Incubation) .................. SUCCESS [3.983s]
[INFO] Eclipse EGit Sources Feature (Incubation) ......... SUCCESS [4.138s]
[INFO] Eclipse Git Plugin Update Site (Incubation) ....... SUCCESS [9.143s]
[INFO] Test Plug-in (Incubation) ......................... SUCCESS [32.984s]
[INFO] EGit UI Test Plug-in (Incubation) ................. FAILURE [6:57.486s]
[INFO] ------------------------------------------------------------------------
[INFO] BUILD FAILURE
[INFO] ------------------------------------------------------------------------
[INFO] Total time: 9:51.913s
[INFO] Finished at: Wed Mar 23 20:57:04 EDT 2011
[INFO] Final Memory: 211M/2081M
[INFO] ------------------------------------------------------------------------
[ERROR] Failed to execute goal org.sonatype.tycho:maven-osgi-test-plugin:0.10.0:test (default-test) on project org.eclipse.egit.ui.test: There are test failures.
[ERROR] 
[ERROR] Please refer to <https://hudson.eclipse.org/hudson/job/egit/ws/org.eclipse.egit.ui.test/target/surefire-reports> for the individual test results.
[ERROR] -> [Help 1]
org.apache.maven.lifecycle.LifecycleExecutionException: Failed to execute goal org.sonatype.tycho:maven-osgi-test-plugin:0.10.0:test (default-test) on project org.eclipse.egit.ui.test: There are test failures.

Please refer to <https://hudson.eclipse.org/hudson/job/egit/ws/org.eclipse.egit.ui.test/target/surefire-reports> for the individual test results.
	at org.apache.maven.lifecycle.internal.MojoExecutor.execute(MojoExecutor.java:199)
	at org.apache.maven.lifecycle.internal.MojoExecutor.execute(MojoExecutor.java:148)
	at org.apache.maven.lifecycle.internal.MojoExecutor.execute(MojoExecutor.java:140)
	at org.apache.maven.lifecycle.internal.LifecycleModuleBuilder.buildProject(LifecycleModuleBuilder.java:84)
	at org.apache.maven.lifecycle.internal.LifecycleModuleBuilder.buildProject(LifecycleModuleBuilder.java:59)
	at org.apache.maven.lifecycle.internal.LifecycleStarter.singleThreadedBuild(LifecycleStarter.java:183)
	at org.apache.maven.lifecycle.internal.LifecycleStarter.execute(LifecycleStarter.java:161)
	at org.apache.maven.DefaultMaven.doExecute(DefaultMaven.java:314)
	at org.apache.maven.DefaultMaven.execute(DefaultMaven.java:151)
	at org.apache.maven.cli.MavenCli.execute(MavenCli.java:445)
	at org.apache.maven.cli.MavenCli.doMain(MavenCli.java:168)
	at org.apache.maven.cli.MavenCli.main(MavenCli.java:132)
	at sun.reflect.NativeMethodAccessorImpl.invoke0(Native Method)
	at sun.reflect.NativeMethodAccessorImpl.invoke(NativeMethodAccessorImpl.java:39)
	at sun.reflect.DelegatingMethodAccessorImpl.invoke(DelegatingMethodAccessorImpl.java:25)
	at java.lang.reflect.Method.invoke(Method.java:597)
	at org.codehaus.plexus.classworlds.launcher.Launcher.launchEnhanced(Launcher.java:290)
	at org.codehaus.plexus.classworlds.launcher.Launcher.launch(Launcher.java:230)
	at org.codehaus.plexus.classworlds.launcher.Launcher.mainWithExitCode(Launcher.java:409)
	at org.codehaus.plexus.classworlds.launcher.Launcher.main(Launcher.java:352)
Caused by: org.apache.maven.plugin.MojoFailureException: There are test failures.

Please refer to <https://hudson.eclipse.org/hudson/job/egit/ws/org.eclipse.egit.ui.test/target/surefire-reports> for the individual test results.
	at org.codehaus.tycho.osgitest.TestMojo.execute(TestMojo.java:401)
	at org.apache.maven.plugin.DefaultBuildPluginManager.executeMojo(DefaultBuildPluginManager.java:107)
	at org.apache.maven.lifecycle.internal.MojoExecutor.execute(MojoExecutor.java:195)
	... 19 more
[ERROR] 
[ERROR] Re-run Maven using the -X switch to enable full debug logging.
[ERROR] 
[ERROR] For more information about the errors and possible solutions, please read the following articles:
[ERROR] [Help 1] http://cwiki.apache.org/confluence/display/MAVEN/MojoFailureException
[ERROR] 
[ERROR] After correcting the problems, you can resume the build with the command
[ERROR]   mvn <goals> -rf :org.eclipse.egit.ui.test
Terminating xvnc.
Window manager warning: Fatal IO error 11 (Resource temporarily unavailable) on display ':10'.
[DRY] Skipping publisher since build result is FAILURE
[FINDBUGS] Skipping publisher since build result is FAILURE
Archiving artifacts
Recording test results
Failed to send e-mail to Matthias Sohn because no e-mail address is known, and no default e-mail domain is configured



Back to the top